{"text_format":"1","workbook":"xlsx","n_sheets":12,"sheets":["Vejledning","Virksomhed","Lønmodtager","Lønseddel","AskatAMSP","ATP-Feriepenge-SH","Afholdt-Ferie","Pension","Oplysningssedler","Startuge","Bogføring","Lønmodtager Standard"],"not_rendered":{"charts":0,"images":0,"macros":1,"external_links":0,"defined_names":21,"comments":4,"pivot_tables":0},"unopened":[],"bounds":{"document_bytes":16777216,"sheet_cells":100000,"rows_first":2000,"rows_last":500,"rows_between":2000,"halvings":0,"cell_chars":16384,"cell_head_chars":4096},"cells_cut":0,"cells_raw":0,"read":"whole","date_system":"1900"}

{"sheet":"Vejledning","index":0,"n_rows":156,"n_cols":2,"rows_kept":156,"cut":false,"hidden":false,"merged":[[0,0,0,2]]}
["BrugerVejledning Net-Løn*Beregning"]
[]
["Zoom = 75%","Afhængig af skærmstørrelse og opløsning kan det"]
[null,"være nødvendigt at gøre visningen på skærmen mindre,"]
[null,"da de enkelte skærmbilleder er meget bredde."]
[null,"Gå op under Vis > Zoom > 75% eller evt. mindre"]
[]
["Vigtigt FIF:","Brug TabulatorTasten, når du har udfyldt et felt,"]
[null,"så kommer du videre til næste mulige indtastningsfelt."]
[]
["Klik på Fanebladene nederst på skærmen og indtast stamdata :"]
[]
["FaneBladet Virksomhed : ","Her indtastes Virksomhedens Stamdata"]
[null,"Se vejledningen på Fanebladet"]
[]
["Fanebladet Lønmodtager :","Her indtastes Lønmodtagerens Stamdata"]
[null,"Ny lønmodtager oprettes på en række (ÅÅÅ overskrives)"]
[null,"Se vejledningen på Fanebladet nederste linier (linie 100 - linie 120)"]
[null,"Afslut altid med at trykke på knappen øverst"]
[]
["Fanebladet Lønseddel :","Her indtastes data til beregning af løn"]
[]
[null,"Tryk på knappen Lav Ny Lønseddel"]
[null,"i omegnen af række 7 kolonne G"]
[]
[null,"Cellen F7 : Tast de første bogstaver i navnet"]
[null,"            på den lønmodtager du vil lave løn for."]
[]
[null,"Eks. Tes + TabulatorTasten og Alle data for"]
[null,"Testperson indsættes automatisk i arket."]
[]
[null,"Følg vejledningerne ved indtastningsfelterne"]
[]
[null,"F8 : Her kan evt. indtastes bogføringsdato"]
[null,"F9 : Her kan evt. indtastes dato for udbetaling af løn "]
[]
[null,"D10 : Månedens navn. Udfyldes ALTID. Vælg fra Liste"]
[]
[null,"B12 : Timelønnen hentes fra fanebladet Lønmodtager"]
[]
[null,"C12 : Periodens Timetal (Måned = 160,3333 t)"]
[]
[null,"E12 : Hvis det er en 1, 2 el. 3-ugers lønseddel"]
[null,"      indtastes KUN STARTUGENUMMER, evt. "]
[null,"      efterfølgende ugenumre beregnes automatisk"]
[]
[null,"A13,A14 indtastes tekst f.eks. Overarbejde ol."]
[null,"B13,B14 indtastes timeløn "]
[null,"C13,C14 indtastes antal timer"]
[]
[null,"B15 indtastes lønperiodens beløb til multimediebeskatning"]
[]
[null,"B16 indtastes B-indkomst (der kan ikke samtidig udbetales A-indkomst)"]
[]
[null,"C17 : Timer med dagpenge/sygeløn"]
[null,"C18 : Antal dage med dagpengegodtgørelse for"]
[null,"      første og anden ledighedsdag"]
[]
[null,"C22: Fri bil, Multimediebeskatning"]
[]
[null,"Hvis du fortryder en lønseddel, efter at du har opdateret År-Til-Dato,"]
[null,"så lav en lønseddel med minus-tal og opdater År-Til-Dato felterne igen"]
[]
["Fanebladet Lønseddel : ","C39 : Her indtastes evt. antal km., hvis lønmodtageren"]
["fortsat","      skal have udbetalt skattefri kørselsgodtgørelse"]
[null,"      Der opsummeres på automatisk på fanebladet oplysningssedler"]
[]
[null,"A54,A55,A56 indtastes tekst v/skattefrie udbetalinger"]
[null,"B54,B55,B56 indtastes beløbet v/skattefrie udbetalinger"]
[null,"Summen af beløbene overføres automatisk til E38"]
[]
[null,"A57 indtastes tekst v/skattefrie rejsegodtgørelse"]
[null,"B57 indtastes beløbet v/skattefrie rejsegodtgørelse"]
[null,"Summen af beløbene overføres automatisk til E38"]
[null,"Der opsummeres automatisk på fanebladet oplysningssedler"]
[]
[null,"Udskriv Lønseddel og Konteringsvejledning :"]
[null,"Ctrl+P og vælg fra side 1 til 2 (kopi til regnskabet)"]
[null,"Ctrl+P og vælg fra side 1 til 1 (kopi til Lønmodtager)"]
[null,"Tjek om lønsedlen ser korrekt ud"]
[]
[null,"Opdater År-Til-Datofelter : "]
[null,"Må først gøres, når lønsedlen er godkendt"]
[null,"Tryk på Knappen Opdater År-Til-Datofelter "]
[]
[null,"Tryk herefter på Knappen Lav-Ny-Lønseddel"]
[]
["Afregning af A-skat,AM,SP :","Når alle lønsedler for måneden er lavet, og"]
[null,"År-Til-Datofelter er opdateret, så"]
[null,"Klik på Fanebladet AskatAMSP og udskriv siden"]
[]
[null,"Klik tilbage på Fanebladet Lønseddel"]
[]
[null,"Tryk herefter på Knappen :"]
[null,"Nulstil Efter Afregning Måned A-skat-AM-SP"]
[null,"(Denne knap befinder sig i positionen F20)"]
[]
[null,"Nu er de månedlige afregningsbeløb vedr. "]
[null,"A-skat/AM/SP nulstillet."]
[]
["Fanebladet ATP-Feriepenge-SH :","Når alle lønsedler for Kvartalet er lavet, og"]
[null,"År-Til-Datofelter er opdateret, så"]
[null,"Klik på Fanebladet ATP-Feriepenge-SH og udskriv siden"]
[]
[null,"Klik tilbage på Fanebladet Lønseddel"]
[]
[null,"Tryk herefter på Knappen :"]
[null,"Nulstil Efter Afregning Kvartal ATP-Feriepenge"]
[null,"(Denne knap befinder sig i positionen F27)"]
[]
[null,"Nu er de kvartalsvise afregningsbeløb vedr. "]
[null,"ATP, feriepenge og feriedage nulstillet."]
[]
["Fanebladet ATP-Feriepenge-SH :","Klik på Fanebladet ATP-Feriepenge-SH og udskriv siden"]
["Afregning af SøgneH. :","BEMÆRK : Du styrer selv udbetaling af skyldig SH."]
[null,"Når du har udbetalt helt eller delvis skyldig SH, så læg"]
[null,"udbetalingen til tallet i kolonne V på Lønmodtagerfaneblad"]
[]
["Afregning af Pension :","Når alle lønsedler for pensionsafregningsperioden er lavet,"]
[null,"og År-Til-Datofelter er opdateret, så"]
[null,"Klik på Fanebladet Pension og udskriv siden"]
[]
[null,"Tryk herefter på Knappen :"]
[null,"Udskriv Afregning af Pension og opdater Indbetalingerne"]
[null,"(Denne knap befinder sig øverst på arket)"]
[]
[null,"Klik tilbage på Fanebladet Lønseddel"]
[]
["Fanebladet Oplysningssedler :","Klik på Fanebladet Oplysningssedler"]
[null,"Sørg for, at År-Til-Datofelter er opdateret"]
[null,"Udskriv oplysningerne til Årsindberetning af lønoplysninger"]
[]
["Nulstil Alle Lønmodtagernes","Klik på Fanebladet Lønseddel"]
["Oplysningssedler"]
["!! Ultimo året !!","Tryk herefter på Knappen :"]
[null,"Nulstil Alle Lønmodtageres Oplysningssedler"]
[null,"(Denne knap befinder sig i positionen F42)"]
[]
[null,"Nu er alle Lønmodtageres År-Til-Dato Felter Nulstillet"]
[]
["Skift af årstal :","Celle B120 indeholder årstal for lønsedlen."]
[null,"Tjek øvrige stamdata for året, hvis du skifter årstal"]
[]
["Næste års lønseddel","Jeg satser på at have Net-Løn for det"]
[null,"nye år klar i starten af januar, og du kan så"]
[null,"gå ind på www.stjernerevision.dk og hente det"]
[null,"nye års version."]
[]
["For de øvede brugere :","Fanebladene : Data v/Virksomhed og Lønmodtager kan så"]
[null,"kopieres over i det nye ark, så du slipper for at"]
[null,"taste dem ind igen."]
[null,"Kopier linier og brug Indsæt Speciel (værdier)"]
[]
["For ikke øvede brugere :","Du kan sende mig en email, hvor du vedhæfter dit"]
[null,"gamle regneark, så skal jeg opdatere det for dig,"]
[null,"mod et gebyr på 300 kr. + moms"]

{"sheet":"Virksomhed","index":1,"n_rows":23,"n_cols":29,"rows_kept":23,"cut":false,"hidden":false,"merged":[]}
["Virksomheder indtastes i stigende SE-NR. orden",null,null,null,null,null,null,null,"Kontoplan systematik for lønkonti v/lønmodtager---------",null,null,null,null,null,null,"Kontonumre for lønkonti v/virksomheden--------------------------",null,null,null,null,null,null,"Lønnen Hæves","Skyldig ","Ej skatpl.","Skyldig","Pensionsb.","Pensions","Skyldig"]
["Virk.navn","SE-nr.","Indehaver","Adresse","Postnr. & By","Lønkladdenavn","Navigatorver.",null,"Dagpenge","ATP","Feriep.&SH","AM-bidrag","SP-bidrag","KM.godtg.","Lønindeh.","ATP","AM-bid.","SP-bid.","Sky.ATP","Sky.AM-bid.","Sky.SP-bid.","Sky.A-skat","Normalt på","Lønindeh.","Regulering","SH-bet.","Lønm.del","Afregning","Pension"]
["A","00 00 00 00","Må ikke slettes",null,null,null,null,"Standard",1,2,5,6,7,8,9,2623,2626,2632,6921,6930,6932,6920,5810,6950,2702,6924,3,2600,6925]
["TestVirk.navn","12 34 56 78","Test.Indehaver","Test.Adr.Virk","1234 Testby","Løn","Navision",null,1,2,5,6,7,8,null,2623,2626,2631,6921,6930,6932,6920,5810,6950,5800,6924,3,2600,6925]
["*","Å","Må ikke slettes"]
[]
[]
["Indtast Virksomhedens Stamdata på linie 4 i Kolonne A til E"]
[]
["Kolonne I til N indtastes Lønmodtager kontonummer systematik :",null,null,null,null,null,"Lønkonto"]
[null,"Eks. Lønmodtager Kontonr. :",null,"Ferieberettiget løn : ",null,2210,"Systematik"]
[null,null,null,"Dagpenge :",null,2211,1]
[null,null,null,"ATP :",null,2212,2]
[null,null,null,"Pensionsbidrag lønm.del :",null,2213,3]
[null,null,null,"Feriepenge & SøgneH. :",null,2215,5]
[null,null,null,"AM-bidrag :",null,2216,6]
[null,null,null,"SP-bidrag :",null,2217,7]
[null,null,null,"Skattefri Kørepenge :",null,2218,8]
[null,"Næste Lønmodtager bruger så kontonumrene 2220-2228 og så fremdeles"]
[null,null,"Kontonummeret for den enkelte lønmodtagers konto for "]
[null,null,"Ferieberettiget løn indtastes på Fanebladet Lønmodtager"]
[]
["Kolonne P til AC indtastes Virksomheds-kontonumre vedr. lønrelaterede konti"]

{"sheet":"Lønmodtager","index":2,"n_rows":117,"n_cols":44,"rows_kept":117,"cut":false,"hidden":false,"merged":[]}
[null,null,null,null,null,null,null,null,null,null,"Løninde-",null,"Perioden","Betaler","Timeløn","LønPeriode","dd-mm-åå","dd-mm-åå","Beregn","Beregn",null,"Summeret","Feriepenge",null,"Løn overføres",null,"Skal starte i AA"]
["                      ","Løn-","Ferie-","Skyldig","Spc.K.",null,null,null,null,"Måneds","holdelses","Perioden","Antal","SP-bid.?","Fast Løn for lønperioden i ","Løs","Dato","Dato","Pension","SøgneH.","Beregnet","Indbetalt","Funktionær=0","Lønmodt.","Til Bankkonto","d7","År Til Dato felter ","Excl. AM & SP-bid.","Lønmodtager","A-skat","Lønmodtager","lønm. + arb.giver","SP-bidrag dagpenge","Til betaling","Udbetalt","Antal gange udb.","Skattefri","Skattefri","Lønindeh.","Indbetalt","Summering","Skattefri",null,"Ej pensionsb."]
["         Navn ","KontoNr.","KontoNr.","løn",6400,"Adresse","Postnr. Og By","Cpr.nr.","Træk%","fradrag","Procent","Feriepenge","Feriedage","Ja = 1","kolonne P","Uge(1,2,3)","Ansat","Fratrådt","Ja=1","Ja=1","SøgneH.","SøgneH.","Timeløn = 1","Række.nr","Reg.nr.  Kontonr.","d7","AM-indk.","Dagpenge & Sygedp. ","AM-bid.","A-skat","SP-bid.","Pensionsbid.","ATP lønm.bid. + arbg.bid.","Feriepenge","Løn netto","Dagpengegodtg.","Bef.godtg. kr.","Bef.godtg. km.","Kr.","Pension","Timer","Rejsegodtg.","B-Indkomst","Fri Bil ol."]
["0 : Må ikke slettes",2200,6923,6940,0," "," "," ","0",0,null,0,27.5,"Nej = 0",null,"Måned",null,null,"Nej=0","Nej=0",0,0,"Fastløn+feriep.=2",4,"1234  1234567890"]
["Søgenavn indtastes i celle F7",2200,6923,6940,0,"Lønm.adr Mangler i Fanebladet Lønmodtager","Lønm. Postnr.&By mangler i Fanebladet Lønmodtager","000000-0000",60,"0",0,0,0,0,0,"Måned","2007-01-01",null,0,0,0,0,1,5]
["Testperson",2200,6923,6940,0,"Lønm.adr Mangler i Fanebladet Lønmodtager","Lønm. Postnr.&By mangler i Fanebladet Lønmodtager","12345678-1234",46,0,0,0,0,0,200,"Måned","2007-01-01",null,0,0,0,0,1,6]
["ÅÅÅ",2200,6923,6940,0,"Lønm.adr Mangler i Fanebladet Lønmodtager","Lønm. Postnr.&By mangler i Fanebladet Lønmodtager","000000-0000",60,"0",0,0,0,0,0,"Måned","2007-01-01",null,0,0,0,0,1,7]
["ÅÅÅ",2200,6923,6940,0,"Lønm.adr Mangler i Fanebladet Lønmodtager","Lønm. Postnr.&By mangler i Fanebladet Lønmodtager","000000-0000",60,"0",0,0,0,0,0,"Måned","2007-01-01",null,0,0,0,0,1,8]
["ÅÅÅ",2200,6923,6940,0,"Lønm.adr Mangler i Fanebladet Lønmodtager","Lønm. Postnr.&By mangler i Fanebladet Lønmodtager","000000-0000",60,"0",0,0,0,0,0,"Måned","2007-01-01",null,0,0,0,0,1,9]
["ÅÅÅ",2200,6923,6940,0,"Lønm.adr Mangler i Fanebladet Lønmodtager","Lønm. Postnr.&By mangler i Fanebladet Lønmodtager","000000-0000",60,"0",0,0,0,0,0,"Måned","2007-01-01",null,0,0,0,0,1,10]
["ÅÅÅ",2200,6923,6940,0,"Lønm.adr Mangler i Fanebladet Lønmodtager","Lønm. Postnr.&By mangler i Fanebladet Lønmodtager","000000-0000",60,"0",0,0,0,0,0,"Måned","2007-01-01",null,0,0,0,0,1,11]
["ÅÅÅ",2200,6923,6940,0,"Lønm.adr Mangler i Fanebladet Lønmodtager","Lønm. Postnr.&By mangler i Fanebladet Lønmodtager","000000-0000",60,"0",0,0,0,0,0,"Måned","2007-01-01",null,0,0,0,0,1,12]
["ÅÅÅ",2200,6923,6940,0,"Lønm.adr Mangler i Fanebladet Lønmodtager","Lønm. Postnr.&By mangler i Fanebladet Lønmodtager","000000-0000",60,"0",0,0,0,0,0,"Måned","2007-01-01",null,0,0,0,0,1,13]
["ÅÅÅ",2200,6923,6940,0,"Lønm.adr Mangler i Fanebladet Lønmodtager","Lønm. Postnr.&By mangler i Fanebladet Lønmodtager","000000-0000",60,"0",0,0,0,0,0,"Måned","2007-01-01",null,0,0,0,0,1,14]
["ÅÅÅ",2200,6923,6940,0,"Lønm.adr Mangler i Fanebladet Lønmodtager","Lønm. Postnr.&By mangler i Fanebladet Lønmodtager","000000-0000",60,"0",0,0,0,0,0,"Måned","2007-01-01",null,0,0,0,0,1,15]
["ÅÅÅ",2200,6923,6940,0,"Lønm.adr Mangler i Fanebladet Lønmodtager","Lønm. Postnr.&By mangler i Fanebladet Lønmodtager","000000-0000",60,"0",0,0,0,0,0,"Måned","2007-01-01",null,0,0,0,0,1,16]
["ÅÅÅ",2200,6923,6940,0,"Lønm.adr Mangler i Fanebladet Lønmodtager","Lønm. Postnr.&By mangler i Fanebladet Lønmodtager","000000-0000",60,"0",0,0,0,0,0,"Måned","2007-01-01",null,0,0,0,0,1,17]
["ÅÅÅ",2200,6923,6940,0,"Lønm.adr Mangler i Fanebladet Lønmodtager","Lønm. Postnr.&By mangler i Fanebladet Lønmodtager","000000-0000",60,"0",0,0,0,0,0,"Måned","2007-01-01",null,0,0,0,0,1,18]
["ÅÅÅ",2200,6923,6940,0,"Lønm.adr Mangler i Fanebladet Lønmodtager","Lønm. Postnr.&By mangler i Fanebladet Lønmodtager","000000-0000",60,"0",0,0,0,0,0,"Måned","2007-01-01",null,0,0,0,0,1,19]
["ÅÅÅ",2200,6923,6940,0,"Lønm.adr Mangler i Fanebladet Lønmodtager","Lønm. Postnr.&By mangler i Fanebladet Lønmodtager","000000-0000",60,"0",0,0,0,0,0,"Måned","2007-01-01",null,0,0,0,0,1,20]
["ÅÅÅ",2200,6923,6940,0,"Lønm.adr Mangler i Fanebladet Lønmodtager","Lønm. Postnr.&By mangler i Fanebladet Lønmodtager","000000-0000",60,"0",0,0,0,0,0,"Måned","2007-01-01",null,0,0,0,0,1,21]
["ÅÅÅ",2200,6923,6940,0,"Lønm.adr Mangler i Fanebladet Lønmodtager","Lønm. Postnr.&By mangler i Fanebladet Lønmodtager","000000-0000",60,"0",0,0,0,0,0,"Måned","2007-01-01",null,0,0,0,0,1,22]
["ÅÅÅ",2200,6923,6940,0,"Lønm.adr Mangler i Fanebladet Lønmodtager","Lønm. Postnr.&By mangler i Fanebladet Lønmodtager","000000-0000",60,"0",0,0,0,0,0,"Måned","2007-01-01",null,0,0,0,0,1,23]
["ÅÅÅ",2200,6923,6940,0,"Lønm.adr Mangler i Fanebladet Lønmodtager","Lønm. Postnr.&By mangler i Fanebladet Lønmodtager","000000-0000",60,"0",0,0,0,0,0,"Måned","2007-01-01",null,0,0,0,0,1,24]
["ÅÅÅ",2200,6923,6940,0,"Lønm.adr Mangler i Fanebladet Lønmodtager","Lønm. Postnr.&By mangler i Fanebladet Lønmodtager","000000-0000",60,"0",0,0,0,0,0,"Måned","2007-01-01",null,0,0,0,0,1,25]
["ÅÅÅ",2200,6923,6940,0,"Lønm.adr Mangler i Fanebladet Lønmodtager","Lønm. Postnr.&By mangler i Fanebladet Lønmodtager","000000-0000",60,"0",0,0,0,0,0,"Måned","2007-01-01",null,0,0,0,0,1,26]
["ÅÅÅ",2200,6923,6940,0,"Lønm.adr Mangler i Fanebladet Lønmodtager","Lønm. Postnr.&By mangler i Fanebladet Lønmodtager","000000-0000",60,"0",0,0,0,0,0,"Måned","2007-01-01",null,0,0,0,0,1,27]
["ÅÅÅ",2200,6923,6940,0,"Lønm.adr Mangler i Fanebladet Lønmodtager","Lønm. Postnr.&By mangler i Fanebladet Lønmodtager","000000-0000",60,"0",0,0,0,0,0,"Måned","2007-01-01",null,0,0,0,0,1,28]
["ÅÅÅ",2200,6923,6940,0,"Lønm.adr Mangler i Fanebladet Lønmodtager","Lønm. Postnr.&By mangler i Fanebladet Lønmodtager","000000-0000",60,"0",0,0,0,0,0,"Måned","2007-01-01",null,0,0,0,0,1,29]
["ÅÅÅ",2200,6923,6940,0,"Lønm.adr Mangler i Fanebladet Lønmodtager","Lønm. Postnr.&By mangler i Fanebladet Lønmodtager","000000-0000",60,"0",0,0,0,0,0,"Måned","2007-01-01",null,0,0,0,0,1,30]
["ÅÅÅ",2200,6923,6940,0,"Lønm.adr Mangler i Fanebladet Lønmodtager","Lønm. Postnr.&By mangler i Fanebladet Lønmodtager","000000-0000",60,"0",0,0,0,0,0,"Måned","2007-01-01",null,0,0,0,0,1,31]
["ÅÅÅ",2200,6923,6940,0,"Lønm.adr Mangler i Fanebladet Lønmodtager","Lønm. Postnr.&By mangler i Fanebladet Lønmodtager","000000-0000",60,"0",0,0,0,0,0,"Måned","2007-01-01",null,0,0,0,0,1,32]
["ÅÅÅ",2200,6923,6940,0,"Lønm.adr Mangler i Fanebladet Lønmodtager","Lønm. Postnr.&By mangler i Fanebladet Lønmodtager","000000-0000",60,"0",0,0,0,0,0,"Måned","2007-01-01",null,0,0,0,0,1,33]
["ÅÅÅ",2200,6923,6940,0,"Lønm.adr Mangler i Fanebladet Lønmodtager","Lønm. Postnr.&By mangler i Fanebladet Lønmodtager","000000-0000",60,"0",0,0,0,0,0,"Måned","2007-01-01",null,0,0,0,0,1,34]
["ÅÅÅ",2200,6923,6940,0,"Lønm.adr Mangler i Fanebladet Lønmodtager","Lønm. Postnr.&By mangler i Fanebladet Lønmodtager","000000-0000",60,"0",0,0,0,0,0,"Måned","2007-01-01",null,0,0,0,0,1,35]
["ÅÅÅ",2200,6923,6940,0,"Lønm.adr Mangler i Fanebladet Lønmodtager","Lønm. Postnr.&By mangler i Fanebladet Lønmodtager","000000-0000",60,"0",0,0,0,0,0,"Måned","2007-01-01",null,0,0,0,0,1,36]
["ÅÅÅ",2200,6923,6940,0,"Lønm.adr Mangler i Fanebladet Lønmodtager","Lønm. Postnr.&By mangler i Fanebladet Lønmodtager","000000-0000",60,"0",0,0,0,0,0,"Måned","2007-01-01",null,0,0,0,0,1,37]
["ÅÅÅ",2200,6923,6940,0,"Lønm.adr Mangler i Fanebladet Lønmodtager","Lønm. Postnr.&By mangler i Fanebladet Lønmodtager","000000-0000",60,"0",0,0,0,0,0,"Måned","2007-01-01",null,0,0,0,0,1,38]
["ÅÅÅ",2200,6923,6940,0,"Lønm.adr Mangler i Fanebladet Lønmodtager","Lønm. Postnr.&By mangler i Fanebladet Lønmodtager","000000-0000",60,"0",0,0,0,0,0,"Måned","2007-01-01",null,0,0,0,0,1,39]
["ÅÅÅ",2200,6923,6940,0,"Lønm.adr Mangler i Fanebladet Lønmodtager","Lønm. Postnr.&By mangler i Fanebladet Lønmodtager","000000-0000",60,"0",0,0,0,0,0,"Måned","2007-01-01",null,0,0,0,0,1,40]
["ÅÅÅ",2200,6923,6940,0,"Lønm.adr Mangler i Fanebladet Lønmodtager","Lønm. Postnr.&By mangler i Fanebladet Lønmodtager","000000-0000",60,"0",0,0,0,0,0,"Måned","2007-01-01",null,0,0,0,0,1,41]
["ÅÅÅ",2200,6923,6940,0,"Lønm.adr Mangler i Fanebladet Lønmodtager","Lønm. Postnr.&By mangler i Fanebladet Lønmodtager","000000-0000",60,"0",0,0,0,0,0,"Måned","2007-01-01",null,0,0,0,0,1,42]
["ÅÅÅ",2200,6923,6940,0,"Lønm.adr Mangler i Fanebladet Lønmodtager","Lønm. Postnr.&By mangler i Fanebladet Lønmodtager","000000-0000",60,"0",0,0,0,0,0,"Måned","2007-01-01",null,0,0,0,0,1,43]
["ÅÅÅ",2200,6923,6940,0,"Lønm.adr Mangler i Fanebladet Lønmodtager","Lønm. Postnr.&By mangler i Fanebladet Lønmodtager","000000-0000",60,"0",0,0,0,0,0,"Måned","2007-01-01",null,0,0,0,0,1,44]
["ÅÅÅ",2200,6923,6940,0,"Lønm.adr Mangler i Fanebladet Lønmodtager","Lønm. Postnr.&By mangler i Fanebladet Lønmodtager","000000-0000",60,"0",0,0,0,0,0,"Måned","2007-01-01",null,0,0,0,0,1,45]
["ÅÅÅ",2200,6923,6940,0,"Lønm.adr Mangler i Fanebladet Lønmodtager","Lønm. Postnr.&By mangler i Fanebladet Lønmodtager","000000-0000",60,"0",0,0,0,0,0,"Måned","2007-01-01",null,0,0,0,0,1,46]
["ÅÅÅ",2200,6923,6940,0,"Lønm.adr Mangler i Fanebladet Lønmodtager","Lønm. Postnr.&By mangler i Fanebladet Lønmodtager","000000-0000",60,"0",0,0,0,0,0,"Måned","2007-01-01",null,0,0,0,0,1,47]
["ÅÅÅ",2200,6923,6940,0,"Lønm.adr Mangler i Fanebladet Lønmodtager","Lønm. Postnr.&By mangler i Fanebladet Lønmodtager","000000-0000",60,"0",0,0,0,0,0,"Måned","2007-01-01",null,0,0,0,0,1,48]
["ÅÅÅ",2200,6923,6940,0,"Lønm.adr Mangler i Fanebladet Lønmodtager","Lønm. Postnr.&By mangler i Fanebladet Lønmodtager","000000-0000",60,"0",0,0,0,0,0,"Måned","2007-01-01",null,0,0,0,0,1,49]
["ÅÅÅ",2200,6923,6940,0,"Lønm.adr Mangler i Fanebladet Lønmodtager","Lønm. Postnr.&By mangler i Fanebladet Lønmodtager","000000-0000",60,"0",0,0,0,0,0,"Måned","2007-01-01",null,0,0,0,0,1,50]
["ÅÅÅ",2200,6923,6940,0,"Lønm.adr Mangler i Fanebladet Lønmodtager","Lønm. Postnr.&By mangler i Fanebladet Lønmodtager","000000-0000",60,"0",0,0,0,0,0,"Måned","2007-01-01",null,0,0,0,0,1,51]
["ÅÅÅ",2200,6923,6940,0,"Lønm.adr Mangler i Fanebladet Lønmodtager","Lønm. Postnr.&By mangler i Fanebladet Lønmodtager","000000-0000",60,"0",0,0,0,0,0,"Måned","2007-01-01",null,0,0,0,0,1,52]
["ÅÅÅ",2200,6923,6940,0,"Lønm.adr Mangler i Fanebladet Lønmodtager","Lønm. Postnr.&By mangler i Fanebladet Lønmodtager","000000-0000",60,"0",0,0,0,0,0,"Måned","2007-01-01",null,0,0,0,0,1,53]
["ÅÅÅ",2200,6923,6940,0,"Lønm.adr Mangler i Fanebladet Lønmodtager","Lønm. Postnr.&By mangler i Fanebladet Lønmodtager","000000-0000",60,"0",0,0,0,0,0,"Måned","2007-01-01",null,0,0,0,0,1,54]
["ÅÅÅ",2200,6923,6940,0,"Lønm.adr Mangler i Fanebladet Lønmodtager","Lønm. Postnr.&By mangler i Fanebladet Lønmodtager","000000-0000",60,"0",0,0,0,0,0,"Måned","2007-01-01",null,0,0,0,0,1,55]
["ÅÅÅ",2200,6923,6940,0,"Lønm.adr Mangler i Fanebladet Lønmodtager","Lønm. Postnr.&By mangler i Fanebladet Lønmodtager","000000-0000",60,"0",0,0,0,0,0,"Måned","2007-01-01",null,0,0,0,0,1,56]
["ÅÅÅ",2200,6923,6940,0,"Lønm.adr Mangler i Fanebladet Lønmodtager","Lønm. Postnr.&By mangler i Fanebladet Lønmodtager","000000-0000",60,"0",0,0,0,0,0,"Måned","2007-01-01",null,0,0,0,0,1,57]
["ÅÅÅ",2200,6923,6940,0,"Lønm.adr Mangler i Fanebladet Lønmodtager","Lønm. Postnr.&By mangler i Fanebladet Lønmodtager","000000-0000",60,"0",0,0,0,0,0,"Måned","2007-01-01",null,0,0,0,0,1,58]
["ÅÅÅ",2200,6923,6940,0,"Lønm.adr Mangler i Fanebladet Lønmodtager","Lønm. Postnr.&By mangler i Fanebladet Lønmodtager","000000-0000",60,"0",0,0,0,0,0,"Måned","2007-01-01",null,0,0,0,0,1,59]
["ÅÅÅ",2200,6923,6940,0,"Lønm.adr Mangler i Fanebladet Lønmodtager","Lønm. Postnr.&By mangler i Fanebladet Lønmodtager","000000-0000",60,"0",0,0,0,0,0,"Måned","2007-01-01",null,0,0,0,0,1,60]
["ÅÅÅ",2200,6923,6940,0,"Lønm.adr Mangler i Fanebladet Lønmodtager","Lønm. Postnr.&By mangler i Fanebladet Lønmodtager","000000-0000",60,"0",0,0,0,0,0,"Måned","2007-01-01",null,0,0,0,0,1,61]
["ÅÅÅ",2200,6923,6940,0,"Lønm.adr Mangler i Fanebladet Lønmodtager","Lønm. Postnr.&By mangler i Fanebladet Lønmodtager","000000-0000",60,"0",0,0,0,0,0,"Måned","2007-01-01",null,0,0,0,0,1,62]
["ÅÅÅ",2200,6923,6940,0,"Lønm.adr Mangler i Fanebladet Lønmodtager","Lønm. Postnr.&By mangler i Fanebladet Lønmodtager","000000-0000",60,"0",0,0,0,0,0,"Måned","2007-01-01",null,0,0,0,0,1,63]
["ÅÅÅ",2200,6923,6940,0,"Lønm.adr Mangler i Fanebladet Lønmodtager","Lønm. Postnr.&By mangler i Fanebladet Lønmodtager","000000-0000",60,"0",0,0,0,0,0,"Måned","2007-01-01",null,0,0,0,0,1,64]
["ÅÅÅ",2200,6923,6940,0,"Lønm.adr Mangler i Fanebladet Lønmodtager","Lønm. Postnr.&By mangler i Fanebladet Lønmodtager","000000-0000",60,"0",0,0,0,0,0,"Måned","2007-01-01",null,0,0,0,0,1,65]
["ÅÅÅ",2200,6923,6940,0,"Lønm.adr Mangler i Fanebladet Lønmodtager","Lønm. Postnr.&By mangler i Fanebladet Lønmodtager","000000-0000",60,"0",0,0,0,0,0,"Måned","2007-01-01",null,0,0,0,0,1,66]
["ÅÅÅ",2200,6923,6940,0,"Lønm.adr Mangler i Fanebladet Lønmodtager","Lønm. Postnr.&By mangler i Fanebladet Lønmodtager","000000-0000",60,"0",0,0,0,0,0,"Måned","2007-01-01",null,0,0,0,0,1,67]
["ÅÅÅ",2200,6923,6940,0,"Lønm.adr Mangler i Fanebladet Lønmodtager","Lønm. Postnr.&By mangler i Fanebladet Lønmodtager","000000-0000",60,"0",0,0,0,0,0,"Måned","2007-01-01",null,0,0,0,0,1,68]
["ÅÅÅ",2200,6923,6940,0,"Lønm.adr Mangler i Fanebladet Lønmodtager","Lønm. Postnr.&By mangler i Fanebladet Lønmodtager","000000-0000",60,"0",0,0,0,0,0,"Måned","2007-01-01",null,0,0,0,0,1,69]
["ÅÅÅ",2200,6923,6940,0,"Lønm.adr Mangler i Fanebladet Lønmodtager","Lønm. Postnr.&By mangler i Fanebladet Lønmodtager","000000-0000",60,"0",0,0,0,0,0,"Måned","2007-01-01",null,0,0,0,0,1,70]
["ÅÅÅ",2200,6923,6940,0,"Lønm.adr Mangler i Fanebladet Lønmodtager","Lønm. Postnr.&By mangler i Fanebladet Lønmodtager","000000-0000",60,"0",0,0,0,0,0,"Måned","2007-01-01",null,0,0,0,0,1,71]
["ÅÅÅ",2200,6923,6940,0,"Lønm.adr Mangler i Fanebladet Lønmodtager","Lønm. Postnr.&By mangler i Fanebladet Lønmodtager","000000-0000",60,"0",0,0,0,0,0,"Måned","2007-01-01",null,0,0,0,0,1,72]
["ÅÅÅ",2200,6923,6940,0,"Lønm.adr Mangler i Fanebladet Lønmodtager","Lønm. Postnr.&By mangler i Fanebladet Lønmodtager","000000-0000",60,"0",0,0,0,0,0,"Måned","2007-01-01",null,0,0,0,0,1,73]
["ÅÅÅ",2200,6923,6940,0,"Lønm.adr Mangler i Fanebladet Lønmodtager","Lønm. Postnr.&By mangler i Fanebladet Lønmodtager","000000-0000",60,"0",0,0,0,0,0,"Måned","2007-01-01",null,0,0,0,0,1,74]
["ÅÅÅ",2200,6923,6940,0,"Lønm.adr Mangler i Fanebladet Lønmodtager","Lønm. Postnr.&By mangler i Fanebladet Lønmodtager","000000-0000",60,"0",0,0,0,0,0,"Måned","2007-01-01",null,0,0,0,0,1,75]
["ÅÅÅ",2200,6923,6940,0,"Lønm.adr Mangler i Fanebladet Lønmodtager","Lønm. Postnr.&By mangler i Fanebladet Lønmodtager","000000-0000",60,"0",0,0,0,0,0,"Måned","2007-01-01",null,0,0,0,0,1,76]
["ÅÅÅ",2200,6923,6940,0,"Lønm.adr Mangler i Fanebladet Lønmodtager","Lønm. Postnr.&By mangler i Fanebladet Lønmodtager","000000-0000",60,"0",0,0,0,0,0,"Måned","2007-01-01",null,0,0,0,0,1,77]
["ÅÅÅ",2200,6923,6940,0,"Lønm.adr Mangler i Fanebladet Lønmodtager","Lønm. Postnr.&By mangler i Fanebladet Lønmodtager","000000-0000",60,"0",0,0,0,0,0,"Måned","2007-01-01",null,0,0,0,0,1,78]
["ÅÅÅ",2200,6923,6940,0,"Lønm.adr Mangler i Fanebladet Lønmodtager","Lønm. Postnr.&By mangler i Fanebladet Lønmodtager","000000-0000",60,"0",0,0,0,0,0,"Måned","2007-01-01",null,0,0,0,0,1,79]
["ÅÅÅ",2200,6923,6940,0,"Lønm.adr Mangler i Fanebladet Lønmodtager","Lønm. Postnr.&By mangler i Fanebladet Lønmodtager","000000-0000",60,"0",0,0,0,0,0,"Måned","2007-01-01",null,0,0,0,0,1,80]
["ÅÅÅ",2200,6923,6940,0,"Lønm.adr Mangler i Fanebladet Lønmodtager","Lønm. Postnr.&By mangler i Fanebladet Lønmodtager","000000-0000",60,"0",0,0,0,0,0,"Måned","2007-01-01",null,0,0,0,0,1,81]
["ÅÅÅ",2200,6923,6940,0,"Lønm.adr Mangler i Fanebladet Lønmodtager","Lønm. Postnr.&By mangler i Fanebladet Lønmodtager","000000-0000",60,"0",0,0,0,0,0,"Måned","2007-01-01",null,0,0,0,0,1,82]
["ÅÅÅ",2200,6923,6940,0,"Lønm.adr Mangler i Fanebladet Lønmodtager","Lønm. Postnr.&By mangler i Fanebladet Lønmodtager","000000-0000",60,"0",0,0,0,0,0,"Måned","2007-01-01",null,0,0,0,0,1,83]
["ÅÅÅ",2200,6923,6940,0,"Lønm.adr Mangler i Fanebladet Lønmodtager","Lønm. Postnr.&By mangler i Fanebladet Lønmodtager","000000-0000",60,"0",0,0,0,0,0,"Måned","2007-01-01",null,0,0,0,0,1,84]
["ÅÅÅ",2200,6923,6940,0,"Lønm.adr Mangler i Fanebladet Lønmodtager","Lønm. Postnr.&By mangler i Fanebladet Lønmodtager","000000-0000",60,"0",0,0,0,0,0,"Måned","2007-01-01",null,0,0,0,0,1,85]
["ÅÅÅ",2200,6923,6940,0,"Lønm.adr Mangler i Fanebladet Lønmodtager","Lønm. Postnr.&By mangler i Fanebladet Lønmodtager","000000-0000",60,"0",0,0,0,0,0,"Måned","2007-01-01",null,0,0,0,0,1,86]
["ÅÅÅ",2200,6923,6940,0,"Lønm.adr Mangler i Fanebladet Lønmodtager","Lønm. Postnr.&By mangler i Fanebladet Lønmodtager","000000-0000",60,"0",0,0,0,0,0,"Måned","2007-01-01",null,0,0,0,0,1,87]
["ÅÅÅ",2200,6923,6940,0,"Lønm.adr Mangler i Fanebladet Lønmodtager","Lønm. Postnr.&By mangler i Fanebladet Lønmodtager","000000-0000",60,"0",0,0,0,0,0,"Måned","2007-01-01",null,0,0,0,0,1,88]
["ÅÅÅ",2200,6923,6940,0,"Lønm.adr Mangler i Fanebladet Lønmodtager","Lønm. Postnr.&By mangler i Fanebladet Lønmodtager","000000-0000",60,"0",0,0,0,0,0,"Måned","2007-01-01",null,0,0,0,0,1,89]
["ÅÅÅ",2200,6923,6940,0,"Lønm.adr Mangler i Fanebladet Lønmodtager","Lønm. Postnr.&By mangler i Fanebladet Lønmodtager","000000-0000",60,"0",0,0,0,0,0,"Måned","2007-01-01",null,0,0,0,0,1,90]
["ÅÅÅ",2200,6923,6940,0,"Lønm.adr Mangler i Fanebladet Lønmodtager","Lønm. Postnr.&By mangler i Fanebladet Lønmodtager","000000-0000",60,"0",0,0,0,0,0,"Måned","2007-01-01",null,0,0,0,0,1,91]
["ÅÅÅ",2200,6923,6940,0,"Lønm.adr Mangler i Fanebladet Lønmodtager","Lønm. Postnr.&By mangler i Fanebladet Lønmodtager","000000-0000",60,"0",0,0,0,0,0,"Måned","2007-01-01",null,0,0,0,0,1,92]
["ÅÅÅ",2200,6923,6940,0,"Lønm.adr Mangler i Fanebladet Lønmodtager","Lønm. Postnr.&By mangler i Fanebladet Lønmodtager","000000-0000",60,"0",0,0,0,0,0,"Måned","2007-01-01",null,0,0,0,0,1,93]
["ÅÅÅ",2200,6923,6940,0,"Lønm.adr Mangler i Fanebladet Lønmodtager","Lønm. Postnr.&By mangler i Fanebladet Lønmodtager","000000-0000",60,"0",0,0,0,0,0,"Måned","2007-01-01",null,0,0,0,0,1,94]
["ÅÅÅ",2200,6923,6940,0,"Lønm.adr Mangler i Fanebladet Lønmodtager","Lønm. Postnr.&By mangler i Fanebladet Lønmodtager","000000-0000",60,"0",0,0,0,0,0,"Måned","2007-01-01",null,0,0,0,0,1,95]
["ÅÅÅ",2200,6923,6940,0,"Lønm.adr Mangler i Fanebladet Lønmodtager","Lønm. Postnr.&By mangler i Fanebladet Lønmodtager","000000-0000",60,"0",0,0,0,0,0,"Måned","2007-01-01",null,0,0,0,0,1,96]
["ÅÅÅ",2200,6923,6940,0,"Lønm.adr Mangler i Fanebladet Lønmodtager","Lønm. Postnr.&By mangler i Fanebladet Lønmodtager","000000-0000",60,"0",0,0,0,0,0,"Måned","2007-01-01",null,0,0,0,0,1,97]
["ÅÅÅ",2200,6923,6940,0,"Lønm.adr Mangler i Fanebladet Lønmodtager","Lønm. Postnr.&By mangler i Fanebladet Lønmodtager","000000-0000",60,"0",0,0,0,0,0,"Måned","2007-01-01",null,0,0,0,0,1,98]
["ÅÅÅ",2200,6923,6940,0,"Lønm.adr Mangler i Fanebladet Lønmodtager","Lønm. Postnr.&By mangler i Fanebladet Lønmodtager","000000-0000",60,"0",0,0,0,0,0,"Måned","2007-01-01",null,0,0,0,0,1,99]
["ÅÅÅÅ : Må ikke slettes, skal være sidste post Indtast Navn i Celle F7",null,null,null,null,null,null," ","100%","0",0,null,null,0,0,"Måned","2007-01-01",null,0,0,0,0,1,24]
[null,null,null,null,null,null,null,null,null,null,null,0,0]
[null,null,null,null,null,null,null,null,null,null,null,{"$f":"SUM(L2:L101)","v":0},null,"Betaler ikke SP-bidrag ?",null,"Lønperiode"]
[null,null,null,null,null,null,null,null,null,null,null,null,null,"Ja = 1 & Nej = 0",null,"Måned"]
[null,null,null,null,null,null,null,null,null,null,null,null,null,null,null,"Løs"]
[null,null,null,null,null,null,null,null,null,null,null,null,null,null,null,1,"= 1 uge"]
[null,null,null,null,null,null,null,null,null,null,null,null,null,null,null,2,"= 2 uger"]
[null,null,null,null,null,null,null,null,null,null,null,null,null,null,null,3,"= 3 uger"]
[null,null,null,null,null,null,null,null,null,null,null,null,null,null,null,"B-Indkomst"]
[null,"AFSLUT MED AT TRYKKE PÅ KNAPPEN : \"Når du er færdig med at indtaste/opdatere Lønmodtager Fanebladet\""]
[]
[null,"HUSK også at indtaste data yderst til højre i regnearket : Timeløn, Lønperiode, Ansættelses/Fratrådt Dato, SH"]
[null,"Træk% og månedsfradrag fra skattekortet, og evt. lønindeholdelses%. "]
[null,"Betaler SP-bidrag ? Lønmodtager født efter 1.7.39 & fylder 65 i år betaler ikke SP."]
[null,"Betaler SP-bidrag ? Lønmodtager født før 30.06.39 & fylder 67 i år betaler ikke SP."]
[null,"Bemærk kolonne W : Funktionær=0 (ingen beregning af feriepenge) ellers =1 beregn feriepenge"]
[null,"Bemærk kolonne Y : Hvis du indsætter lønudbetalingen på lønmodtagerens bankkonto så skriv kontonummeret her"]
[null,"Bemærk kolonne Y : Hvis du bruger bankoverførsel så HUSK dato i felt F9 på lønsedlen !"]

{"sheet":"Lønseddel","index":3,"n_rows":174,"n_cols":19,"rows_kept":174,"cut":false,"hidden":false,"merged":[]}
[null,null,null,null,null,"Antal Lønsedler",null,{"$f":"D2","v":"SE-NR.........................."},{"$f":"E2","v":"12 34 56 78"}]
[null,null,null,{"$f":"\"SE-NR.\"&REPT(\".\",25)","v":"SE-NR.........................."},{"$f":"LOOKUP(D3,Virksomhed!A4:A6,Virksomhed!B4:B6)","v":"12 34 56 78"},"Godkendt",{"$f":"R2","v":0},{"$f":"D3","v":"TestVirk.navn"},null,null,null,null,null,null,null,null,null,0,"Antal godkendte lønsedler"]
[null,null,null,{"$f":"Virksomhed!A4","v":"TestVirk.navn"},null,null,null,{"$f":"D4","v":"v/Test.Indehaver"},null,null,null,null,null,null,null,null,null,100,"Maxantal lønsedler Licens"]
[null,null,null,{"$f":"\"v/\"&LOOKUP($D$3,Virksomhed!A4:A6,Virksomhed!C4:C6)","v":"v/Test.Indehaver"},null,null,null,{"$f":"D5","v":"Test.Adr.Virk"}]
[{"$f":"R5","v":0},null,null,{"$f":"LOOKUP($D$3,Virksomhed!A4:A6,Virksomhed!D4:D6)","v":"Test.Adr.Virk"},null,{"$f":"IF(MID(T(A7),1,7)=\"Indtast\",\"Indtast SøgeNavn\",\"\")","v":""},null,{"$f":"D6","v":"1234 Testby"}]
[null,null,null,{"$f":"LOOKUP($D$3,Virksomhed!A4:A6,Virksomhed!E4:E6)","v":"1234 Testby"},null,{"$f":"IF(MID(T(A7),1,7)=\"Indtast\",\"¯¯¯ \",\"\")","v":""},{"$f":"A5","v":0}]
[{"$f":"IF(F7<>MID(H7,1,LEN(F7)),\"Indtast Lønmodtager/SøgeNavn F7\",H7)","v":"Testperson"},null,null,{"$f":"\"CPR-NR.\"&REPT(\".\",100)","v":"CPR-NR....................................................................................................."},{"$f":"LOOKUP(A7,Lønmodtager!A4:A105,Lønmodtager!H4:H105)","v":"12345678-1234"},"test",null,{"$f":"LOOKUP(MID(F7,1,LEN(F7)),MID(Lønmodtager!A4:A100,1,LEN(F7)),Lønmodtager!A4:A100)","v":"Testperson"}]
[{"$f":"IF(F7<>\"SøgeNavn\",LOOKUP(A7,Lønmodtager!A4:A100,Lønmodtager!F4:F100),\"\")","v":"Lønm.adr Mangler i Fanebladet Lønmodtager"},null,null,null,null,"31-01-2019",null,{"$f":"A8","v":"Lønm.adr Mangler i Fanebladet Lønmodtager"}]
[{"$f":"IF(F7<>\"SøgeNavn\",LOOKUP(A7,Lønmodtager!A4:A100,Lønmodtager!G4:G100),\"\")","v":"Lønm. Postnr.&By mangler i Fanebladet Lønmodtager"},{"$f":"IF((T(B20)=\"Fejl\")*(L_NPER<>\"B-Indkomst\")=1,\"Fejl Lønart\",\"\")","v":""},{"$f":"IF(F7<>\"SøgeNavn\",IF(D12<>\"\",IF((E12<LOOKUP(D10,Startuge!A3:A16,Startuge!B3:B16)),\"Fejl i Måned eller startugenr.   Ret celle D10 eller E12\",IF(E12>(LOOKUP(D10,Startuge!A3:A16,Startuge!B3:B16)+4),\"Fejl i Måned eller startugenr.   Ret celle D10 eller E12\",\"\")),\"\"),\"\")","v":""},null,null,"31-01-2019",null,{"$f":"A9","v":"Lønm. Postnr.&By mangler i Fanebladet Lønmodtager"}]
[{"$f":"IF(LOOKUP(A7,Lønmodtager!A4:A100,Lønmodtager!I4:I100)=\"%\",\"Træk% ej indtastet. \",\"\")&IF(B28<>0,IF(OR(E10=\"2004\",E10=\"2005\"),\"Nul SP-bidrag i 2004/2005, Tjek på lønmodtagerfaneblad kolonne N. \",\"\"),\"\")&IF(AND(K11<>1,C12<>\"\"),\"Der kan ikke indtastes timer for en funktionær eller lønmodtager med fast fast løn. \",\"\")","v":""},{"$f":"IF(T(B9)<>\"\",\"¯¯\",\"\")","v":""},null,"Januar",{"$f":"B122","v":"2019"},{"$f":"IF(MID(A7,1,7)=\"Indtast\",\"Navnet findes ikke i lønmodtager oversigten\",\"Navnet er ok\")","v":"Navnet er ok"},null,null,null,null,"Funktionær=0 Timeløn =1 Fast Løn =2","Lønkonto: ",{"$f":"LOOKUP(A7,Lønmodtager!A4:A100,Lønmodtager!B4:B100)","v":2200}]
[{"$f":"\"Lønperiode\"&REPT(\".\",200)","v":"Lønperiode........................................................................................................................................................................................................"},{"$f":"LOOKUP(A7,Lønmodtager!A4:A100,Lønmodtager!P4:P100)","v":"Måned"},{"$f":"IF(B11=\"1\",\"Uge\",IF(B11=\"2\",\"Uger\",IF(B11=\"3\",\"Uger\",\"\")))","v":""},{"$f":"T(IF(D12=\"\",IF(E12<>0,\"Slet ugennr.\",\"\")))","v":""},{"$f":"IF(T(D11)<>\"\",\"¯¯¯   \",IF(T(C9)<>\"\",\"¯¯¯  \",\"\"))","v":""},{"$f":"IF(F10=\"Navnet er ok\",\"\",\"Opret lønmodtageren i lønmodtageroversigten\")","v":""},null,null,null,null,{"$f":"LOOKUP(A7,Lønmodtager!A4:A100,Lønmodtager!W4:W100)","v":1}]
[{"$f":"IF(LOOKUP(A7,Lønmodtager!A4:A100,Lønmodtager!W4:W100)<>1,\"Fast Løn\",\"Timeløn\")&REPT(\".\",300)","v":"Timeløn............................................................................................................................................................................................................................................................................................................"},{"$f":"LOOKUP(A7,Lønmodtager!A4:A100,Lønmodtager!O4:O100)","v":200},0,{"$f":"IF(B11=\"1\",\"Ugenr.\",IF(B11=\"2\",\"Ugenr.\",IF(B11=\"3\",\"Ugenr.\",\"\")))","v":""},null,{"$f":"D10","v":"Januar"},{"$f":"E10","v":"2019"},"Timer summeres","Lønmodtager bankkontonr. :",null,{"$f":"LOOKUP(A7,Lønmodtager!A4:A100,Lønmodtager!Y4:Y100)","v":0}]
[null,0,0,{"$f":"IF($B$11=\"2\",\"Ugenr.\",IF($B$11=\"3\",\"Ugenr.\",\"\"))","v":""},{"$f":"IF($D$13<>\"\",IF($E$12>0,IF($E$12<52,$E$12+1,\"Fejl ugenr.\"),\"\"),\"\")","v":""},"Timer ialt",{"$f":"SUM(C12:C17)+0.000000000000001+IF(AND(C12=0,K11<>1),IF(B12<>0,C134*4.111111111,0))","v":1.0000000000000001E-15},{"$f":"SUM(C12:C13)+0.000000000000001+IF(AND(C12=0,K11<>1),IF(B12<>0,C134*4.111111111,0))","v":1.0000000000000001E-15},"Lønmodtager rækkenr. :",null,null,{"$f":"LOOKUP(A7,Lønmodtager!A4:A100,Lønmodtager!X4:X19)","v":6},null,"Fortegn timer",{"$f":"IF(TIMER<=0,-1,1)","v":1}]
[null,0,0,{"$f":"IF($B$11=\"3\",\"Ugenr.\",\"\")","v":""},{"$f":"IF($D$14<>\"\",IF($E$12>0,IF($E$12<51,$E$12+2,\"Fejl ugenr.\"),\"\"),\"\")","v":""},"Virksomhedens"," KONTERINGSVEJLEDNING"]
[{"$f":"IF(B15<>0,\"Multimediebeskatning\"&REPT(\".\",300),\"\")","v":""},null,0,null,null,"andel"]
[{"$f":"IF(L_NPER=\"B-Indkomst\",\"B-Indkomst\",\"\")","v":""},0,0,null,null,"lønudgift","konto","beløb","modkonto"]
[{"$f":"IF(C17<>0,\"Periodens timer på sygedagpenge\"&REPT(\".\",100),\"\")","v":""},{"$f":"B151*5/B155","v":117.70270270270271},0]
[{"$f":"IF(C18<>0,\"Dagpengegodtgørelse 1.&2. ledighedsdag / dage\"&REPT(\".\",100),\"\")","v":""},{"$f":"B152","v":871},0]
[{"$f":"IF(B11=\"Feriepenge\",\"Feriepenge\",IF(L_NPER=\"B-Indkomst\",\"B-Indkomst\",\"Ferieberettiget løn\")&REPT(\".\",300))","v":"Ferieberettiget løn............................................................................................................................................................................................................................................................................................................"},null,{"$f":"C12*B12+IF(AND(C12=0,K11<>1),B12,0)+C13*B13+IF(C13=0,B13,0)+C14*B14+IF(C14=0,B14,0)+C15*B15+IF(C15=0,B15,0)+C16*B16+IF(C16=0,B16,0)","v":0},null,null,{"$f":"C19","v":0},{"$f":"IF(H19<>0,LOOKUP(A7,Lønmodtager!A4:A100,Lønmodtager!B4:B100),\"\")","v":""},{"$f":"C19","v":0}]
[{"$f":"IF(C20<>0,\"ATP Lønmodtagerbidrag\" &REPT(\".\",300)&\"max/lønm./arbg. v/løn/andel sygedagp.\"&REPT(\".\",100),\"\")","v":""},{"$f":"ATPKR*IF(B11=\"Løs\",3,1)","v":284},{"$f":"IF(TIMER*FortegnTimer<ATPUG,0,(IF(TIMER*FortegnTimer<ATPUG*2,-B20/9,(IF(TIMER*FortegnTimer<ATPUG*3,-B20*2/9,-B20/3)))))*FortegnTimer+0.01*(TIMER>=117)*(B11=\"Måned\")+0.01*(TIMER>=39)*(B11=\"Måned\")","v":0},{"$f":"C20*2","v":0},null,{"$f":"-D20","v":0},{"$f":"IF(H20<>0,M10+VALUE(LOOKUP(D3,Virksomhed!A4:A6,Virksomhed!J4:J6)),\"\")","v":""},{"$f":"SUM(C20:C20)*IF(C24*FortegnTimer<0,0,1)","v":0}]
[{"$f":"IF(C21<>0,\"Pensionsbidrag lønmodtager\"&REPT(\".\",100),\"\")","v":""},{"$f":"B157*(C19+C42)","v":0},{"$f":"(INT(-B21*B158*100+0.5)/100)*LOOKUP(A7,Lønmodtager!A4:A100,Lønmodtager!S4:S100)","v":0},{"$f":"(INT(-B21*B159*100+0.5)/100)*LOOKUP(A7,Lønmodtager!A4:A100,Lønmodtager!S4:S100)","v":0}]
[{"$f":"IF(C22<>0,\"Fri Bil, Ferietillæg ol. ej pensionsberettiget\" &REPT(\".\",300),\"\")","v":""},null,null,null,null,{"$f":"C22","v":0},null,{"$f":"C22","v":0}]
[null,null,"——————————"]
[null," ",{"$f":"SUM(C19:C23)","v":0},"——————————>",{"$f":"C24","v":0}]
[null,null,null,null,"——————————"]
[{"$f":"IF(L_NPER<>\"B-Indkomst\",\"Beregningsgrundlag AM/SP-bidrag\"&REPT(\".\",300),\"\")","v":"Beregningsgrundlag AM/SP-bidrag............................................................................................................................................................................................................................................................................................................"},null,null,null,{"$f":"SUM(E19:E25)-IF(C24*FortegnTimer<0,C24,0)*IF(L_NPER=\"B-Indkomst\",0,1)","v":0},{"$f":"C64+H26","v":0},{"$f":"IF(H26<>0,G19+VALUE(LOOKUP(D3,Virksomhed!A4:A6,Virksomhed!AA4:AA6)),\"\")","v":""},{"$f":"C21","v":0}]
[{"$f":"IF(L_NPER<>\"B-Indkomst\",\"AM-bidrag\"&REPT(\".\",200),\"\")","v":"AM-bidrag........................................................................................................................................................................................................"},{"$f":"IF(L_NPER<>\"B-Indkomst\",B149,\"\")","v":0.08},{"$f":"IF(B27<>0,REPT(\".\",300),\"\")","v":"............................................................................................................................................................................................................................................................................................................"},null,{"$f":"-TRUNC(E26*B27+0.5*FortegnTimer)","v":0}]
[{"$f":"IF(B28<>0,\"SP-bidrag v/løn\"&REPT(\".\",100),\"\")","v":""},{"$f":"IF(L_NPER<>\"B-Indkomst\",B150,\"\")","v":0},{"$f":"IF(B28<>0,REPT(\".\",300),\"\")","v":""},null,{"$f":"-TRUNC(E26*B28+0.5)","v":0}]
[null,null,null,null,"——————————"]
[{"$f":"IF(L_NPER=\"B-Indkomst\",\"B-Indkomst\",\"A-indkomst v/løn\")&REPT(\".\",300)","v":"A-indkomst v/løn............................................................................................................................................................................................................................................................................................................"},null,null,{"$f":"IF(L_NPER<>\"B-Indkomst\",E30,\"\")","v":0},{"$f":"SUM(E26:E29)","v":0}]
[{"$f":"IF(D31<>0,\"Dagpengegodtgørelse 1.& 2. ledighedsdag\"&REPT(\".\",200),\"\")","v":""},null,null,{"$f":"IF(D68>=B153,0,B152*C18)","v":0},{"$f":"D31","v":0},{"$f":"E31","v":0},{"$f":"IF(D31<>0,G19+VALUE(LOOKUP(D3,Virksomhed!A4:A6,Virksomhed!I4:I6)),\"\")","v":""},{"$f":"D31","v":0}]
[{"$f":"IF(D32<>0,\"Sygedagpenge\"&REPT(\".\",200),\"\")","v":""},null,null,{"$f":"B17*C17","v":0},{"$f":"D32","v":0},{"$f":"E32","v":0},{"$f":"IF(D32<>0,M10+VALUE(LOOKUP(D3,Virksomhed!A4:A6,Virksomhed!I4:I6)),\"\")","v":""},{"$f":"D32","v":0}]
[{"$f":"IF(D33<>0,IF(B28<>0,\"SP-bidrag og \",\"\")&IF(C24<0,\"ATP\",\"\")&\" af Dagpenge indbetales til ATP\"&REPT(\".\",200),\"\")","v":""},null,null,{"$f":"(TRUNC((-SUM(D32:D32))*B28-0.5)+IF(C24*FortegnTimer<=0,C24,0))*IF(L_NPER=\"B-Indkomst\",0,1)","v":0},{"$f":"D33","v":0},null,{"$f":"IF(D33<>0,M10+VALUE(LOOKUP(D3,Virksomhed!A4:A6,Virksomhed!J4:J6)),\"\")","v":""},{"$f":"D33","v":0}]
[{"$f":"IF(L_NPER<>\"B-Indkomst\",\"Fradrag ifgl. Skattekort\"&REPT(\".\",200),\"\")","v":"Fradrag ifgl. Skattekort........................................................................................................................................................................................................"},null,null,{"$f":"IF(B11=\"Måned\",-B139,IF(B11=\"14 DG\",-C139,IF(B11=\"1\",-D139,IF(B11=\"2\",-C139,IF(B11=\"3\",-D139*3,IF(B11=\"Løs\",-DAGFRD*TIMER/E155,IF(B11=\"Feriepenge\",0,0)))))))*IF(L_NPER<>\"Løs\",FortegnTimer,1)","v":0}]
[null,null,null,{"$f":"IF(L_NPER<>\"B-Indkomst\",\"——————————\",\"\")","v":"——————————"}]
[{"$f":"IF(L_NPER<>\"B-Indkomst\",\"Trækgrundlag\"&REPT(\".\",300),\"\")","v":"Trækgrundlag............................................................................................................................................................................................................................................................................................................"},null,null,{"$f":"MAXA(SUM(D30:D35)*FortegnTimer,0)","v":0}]
[{"$f":"IF(L_NPER<>\"B-Indkomst\",\"Reguleret trækgrundlag\"&REPT(\".\",200),\"\")","v":"Reguleret trækgrundlag........................................................................................................................................................................................................"},null,null,{"$f":"D36","v":0}]
[{"$f":"IF(L_NPER<>\"B-Indkomst\",\"A-skat af løn\"&REPT(\".\",200),\"\")","v":"A-skat af løn........................................................................................................................................................................................................"},{"$f":"IF(L_NPER<>\"B-Indkomst\",B143,0)","v":0.46},null,{"$f":"-TRUNC(D37*B38+0.99*0)*FortegnTimer","v":0},{"$f":"D38","v":0}]
[{"$f":"IF(E39<>0,\"Skattefrie udbetalinger & reguleringer - se specifikation nedenfor\"&REPT(\".\",160),\"\")","v":""},null,null,null,{"$f":"SUM(B55:B58)","v":0}]
[{"$f":"IF(C40<>0,\"Skattefri befordringsgodtgørelse  sats / km.\"&REPT(\".\",200),\"\")","v":""},{"$f":"IF(C40<>0,IF(D70<=B160,B161,B164),\"\")","v":""},0,{"$f":"IF(E40<>0,REPT(\".\",160),\"\")","v":""},{"$f":"IF(C40<>\"\",B40*(C40-D164)+D164*B164,\"\")","v":""},{"$f":"E40","v":""},{"$f":"IF(C40<>\"\",G19+LOOKUP(D3,Virksomhed!A4:A6,Virksomhed!N4:N6),\"\")","v":""},{"$f":"E40","v":""}]
[{"$f":"IF(C41<>\"\",\"Lønindeholdelse\"&REPT(\".\",200),\"\")","v":""},null,{"$f":"IF(LOOKUP(A7,Lønmodtager!A4:A100,Lønmodtager!K4:K100)<>\"\",LOOKUP(A7,Lønmodtager!A4:A100,Lønmodtager!K4:K100),\"\")","v":""},{"$f":"IF(E41<>0,REPT(\".\",160),\"\")","v":""},{"$f":"IF((-SUM(E30:E38))*C41<>0,(-SUM(E30:E38))*C41,\"\")","v":""},{"$f":"E41","v":""},{"$f":"IF(C41<>\"\",LOOKUP(D3,Virksomhed!A4:A6,Virksomhed!X4:X6),\"\")","v":""},{"$f":"E41","v":""}]
[{"$f":"IF(L_NPER<>\"B-Indkomst\",IF(B168*B144<>0,\"Søgnehelligdag\",\"\")&IF((B154*LOOKUP(A7,Lønmodtager!A4:A100,Lønmodtager!W4:W100)<>0)*(B168*B144<>0),\" & \",\"\")&IF(B154*LOOKUP(A7,Lønmodtager!A4:A100,Lønmodtager!W4:W100)<>0,\"Feriepenge\",\"\")&IF((B154+B168*B144)*LOOKUP(A7,Lønmodtager!A4:A100,Lønmodtager!W4:W100)<>0,REPT(\".\",200),\"\"),\"\")","v":"Feriepenge........................................................................................................................................................................................................"},{"$f":"IF((B154+B168*B144)*LOOKUP(A7,Lønmodtager!A4:A100,Lønmodtager!W4:W100)<>0,IF(B134<>\"Feriepenge\",B154+B168*B144,0),\"\")*(IF(L_NPER<>\"B-Indkomst\",1,0))","v":0.125},{"$f":"INT(L_N*B42*100+0.5)/100","v":0},null,null,{"$f":"C42","v":0},{"$f":"IF(C42<>0,G19+LOOKUP(D3,Virksomhed!A4:A6,Virksomhed!K4:K6),\"\")","v":""},{"$f":"C42","v":0}]
[{"$f":"IF(B42<>0,\"AM-bidrag\"&REPT(\".\",200),\"\")","v":"AM-bidrag........................................................................................................................................................................................................"},{"$f":"IF(B42<>0,B27,\"\")","v":0.08},{"$f":"-TRUNC(C42*B43)","v":0}]
[{"$f":"IF(B44<>0,\"SP-bidrag\"&REPT(\".\",200),\"\")","v":""},{"$f":"IF(B42<>0,B150,\"\")","v":0},{"$f":"-TRUNC(C42*B44)","v":0}]
[{"$f":"IF(B42<>0,\"Beregnet feriepenge fradrag\"&REPT(\".\",100),\"\")","v":"Beregnet feriepenge fradrag...................................................................................................."},{"$f":"IF(B42<>0,IF(L_NPER=\"Feriepenge\",\" \",L_NPER&\" \"&MID(D12,1,3)),\"\")","v":"Måned "},{"$f":"IF(C42<>0,IF(B11=\"Måned\",-B141,(IF(B11=\"14 DG\",-C141,(IF(B11=\"1\",-D141,(IF(B11=\"2\",-D141*2,(IF(B11=\"3\",-D141*3,(IF(B11=\"Feriepenge\",0,-E141*TIMER/E155)))))))))))*B166,0)*IF(L_NPER<>\"Løs\",FortegnTimer,1)","v":0}]
[null,null,{"$f":"IF(B42<>0,\"——————————\",\"\")","v":"——————————"}]
[{"$f":"IF(B42<>0,\"Trækgrundlag\"&REPT(\".\",200),\"\")","v":"Trækgrundlag........................................................................................................................................................................................................"},null,{"$f":"MAXA(SUM(C42:C46)*FortegnTimer,0)","v":0}]
[{"$f":"IF(B42<>0,\"Nedrundet trækgrundlag\"&REPT(\".\",200),\"\")","v":"Nedrundet trækgrundlag........................................................................................................................................................................................................"},null,{"$f":"TRUNC(C47)*FortegnTimer","v":0}]
[{"$f":"IF(B42<>0,\"A-skat af \"&A42&REPT(\".\",200),\"\")","v":"A-skat af Feriepenge................................................................................................................................................................................................................................................................................................................................................................................................................"},{"$f":"IF(B42<>0,B38,\"\")","v":0.46},{"$f":"-TRUNC(C48*B49+0.5)","v":0},{"$f":"C49","v":0}]
[null,null,{"$f":"IF(B42<>0,\"——————————\",\"\")","v":"——————————"}]
[{"$f":"A42","v":"Feriepenge........................................................................................................................................................................................................"},{"$f":"(IF((B168+B154)<>0,INT(100*(C42+C43+C44+C49)*B168/(B168+B154)+0.5)/100,0))*LOOKUP(A7,Lønmodtager!A4:A100,Lønmodtager!T4:T100)","v":0},{"$f":"INT(((C42+C43+C44+C49)-B51)*100)/100","v":0},{"$f":"IF(L_NPER<>\"B-Indkomst\",\"——————————\",\"\")","v":"——————————"},null,null,{"$f":"IF(C51<>0,LOOKUP(A7,Lønmodtager!A4:A100,Lønmodtager!C4:C100),\"\")","v":""},{"$f":"-C51","v":0}]
[{"$f":"IF(L_NPER<>\"B-Indkomst\",\"A-skat\"&REPT(\".\",300),\"\")","v":"A-skat............................................................................................................................................................................................................................................................................................................"},null,null,{"$f":"-D38-D49","v":0},"——————————","——————————",{"$f":"IF(B51<>0,LOOKUP(D3,Virksomhed!A4:A6,Virksomhed!Z4:Z6),\"\")","v":""},{"$f":"-B51","v":0}]
[{"$f":"IF(B11=\"Feriepenge\",\"Feriepenge\",IF(K12=\"\",\"Udbetaling\"&REPT(\".\",300),\"Lønudbetaling overføres d. \"&F9&\" til Bankkontonr. \"&K12&REPT(\".\",300)))","v":"Udbetaling............................................................................................................................................................................................................................................................................................................"},null,null,null,{"$f":"SUM(E30:E52)","v":0},{"$f":"SUM(F14:F52)","v":0},{"$f":"IF(E53<>0,LOOKUP(A7,Lønmodtager!A4:A100,Lønmodtager!D4:D100),\"\")","v":""},{"$f":"-E53","v":0}]
[{"$f":"IF(SUM(B55:B58)<>0,\"Skattefrie udbetalinger & reguleringer :\",\"\")","v":""},null,null,null,"——————————","——————————"]
[null,0]
[null,0,null,null,null,null,{"$f":"IF(LOOKUP(A7,Lønmodtager!A4:A100,Lønmodtager!E4:E100)=0,\"\",LOOKUP(A7,Lønmodtager!A4:A100,Lønmodtager!E4:E100))","v":""},{"$f":"IF(G56<>\"\",F53,\"\")","v":""},{"$f":"IF(G56<>\"\",6098,\"\")","v":""}]
[{"$f":"IF(B57<>0,\"Modregning v/Fri Bil og Multimediebeskatning\"&REPT(\".\",200),\"\")","v":""},{"$f":"-B15-C22+(-(C22+B15)+(INT((C22+B15)*B27+0.5)+INT((C22+B15)*(100%-B27)*B38+0.5)))*0","v":0},null,"Sidste md.","Indev. år",{"$f":"IF(E39<>\"\",\"Ej skpl.reg.\",\"\")","v":""},{"$f":"IF(E39<>\"\",LOOKUP(D3,Virksomhed!A4:A6,Virksomhed!Y4:Y6),\"\")","v":""},{"$f":"E39","v":0}]
[null,0,"Perioden","År t. dato","til dato",{"$f":"IF(E39<>\"\",\"Tjek kontonr.\",\"\")","v":""}]
[{"$f":"IF(E59<>0,\"AM-indkomst\"&REPT(\".\",200),\"\")","v":""},null,{"$f":"IF(L_NPER<>\"B-Indkomst\",E26+C42,0)","v":0},{"$f":"LOOKUP(A7,Lønmodtager!A4:A100,Lønmodtager!AA4:AA100)","v":0},{"$f":"SUM(C59:D59)","v":0},{"$f":"IF(C64<>0,\"Pensionsafr.\",\"\")","v":""},{"$f":"IF(H59<>0,LOOKUP(D3,Virksomhed!A4:A8,Virksomhed!AB4:AB8),\"\")","v":""},{"$f":"C64","v":0},{"$f":"IF(H59<>0,LOOKUP(D3,Virksomhed!A4:A6,Virksomhed!AC4:AC6),\"\")","v":""}]
[{"$f":"IF(E60<>0,\"Dagp.godtg. & Sygedp. uden AM-bidrag\"&IF(B44<>0,\" & fratrukket SP-bid.\",\"\")&REPT(\".\",200),\"\")","v":""},null,{"$f":"D31+D32+D33","v":0},{"$f":"LOOKUP(A7,Lønmodtager!A4:A100,Lønmodtager!AB4:AB100)","v":0},0,{"$f":"IF(H60<>0,\"AM-bidrag\",\"\")","v":""},{"$f":"IF(H60<>0,G19+LOOKUP(D3,Virksomhed!A4:A8,Virksomhed!L4:L8),\"\")","v":""},{"$f":"-C61","v":0}]
[{"$f":"IF(E61<>0,\"AM-bidrag\"&REPT(\".\",200),\"\")","v":""},null,{"$f":"-(E27+C43)","v":0},{"$f":"LOOKUP(A7,Lønmodtager!A4:A100,Lønmodtager!AC4:AC100)","v":0},0,{"$f":"IF(H61<>0,\"AM-bidrag\",\"\")","v":""},{"$f":"IF(H61<>0,LOOKUP(D3,Virksomhed!A4:A6,Virksomhed!Q4:Q6),\"\")","v":""},{"$f":"C61","v":0},{"$f":"IF(H61<>0,LOOKUP(D3,Virksomhed!A4:A6,Virksomhed!T4:T6),\"\")","v":""}]
[{"$f":"IF(E62<>0,\"A-skat\"&REPT(\".\",200),\"\")","v":""},null,{"$f":"D52","v":0},{"$f":"LOOKUP(A7,Lønmodtager!A4:A100,Lønmodtager!AD4:AD100)","v":0},0,{"$f":"IF(H62<>0,\"A-Skat\",\"\")","v":""},{"$f":"IF(H62<>0,LOOKUP(D3,Virksomhed!A4:A6,Virksomhed!V4:V6),\"\")","v":""},{"$f":"-C62","v":0}]
[{"$f":"IF(E63<>0,\"SP-bidrag\"&REPT(\".\",200),\"\")","v":""},null,{"$f":"-E28-C44","v":0},{"$f":"LOOKUP(A7,Lønmodtager!A4:A100,Lønmodtager!AE4:AE100)","v":0},0,{"$f":"IF(H63<>0,\"SP-bidrag\",\"\")","v":""},{"$f":"IF(H63<>0,G19+LOOKUP(D3,Virksomhed!A4:A6,Virksomhed!M4:M6),\"\")","v":""},{"$f":"-C63","v":0}]
[{"$f":"IF(E64<>0,\"Pensionsbidrag lønmodtager + arb.giver\"&REPT(\".\",200),\"\")","v":""},null,{"$f":"-C21-D21","v":0},{"$f":"LOOKUP(A7,Lønmodtager!A4:A100,Lønmodtager!AF4:AF100)","v":0},0,{"$f":"IF(H64<>0,\"SP-bidrag\",\"\")","v":""},{"$f":"IF(H64<>0,LOOKUP(D3,Virksomhed!A4:A6,Virksomhed!R4:R6),\"\")","v":""},{"$f":"C63","v":0},{"$f":"IF(H64<>0,LOOKUP(D3,Virksomhed!A4:A6,Virksomhed!U4:U6),\"\")","v":""}]
[{"$f":"IF(E65<>0,\"ATP lønm.bid. + arbg.bid.\"&IF(B44<>0,\" + SP-bidrag af dagpenge\",\"\")&REPT(\".\",200),\"\")","v":""},null,{"$f":"-C20-D20-D33+IF(C24*FortegnTimer<0,C20,0)+0.01*(TIMER>=117)*(B11=\"Måned\")+0.04*(TIMER>=78)*(B11=\"Måned\")+0.01*(TIMER>=39)*(B11=\"Måned\")","v":0},{"$f":"LOOKUP(A7,Lønmodtager!A4:A100,Lønmodtager!AG4:AG100)","v":0},0,{"$f":"IF(H65<>0,\"ATP-bidrag\",\"\")","v":""},{"$f":"IF(H65<>0,LOOKUP(D3,Virksomhed!A4:A6,Virksomhed!P4:P6),\"\")","v":""},{"$f":"C65","v":0},{"$f":"IF(H65<>0,LOOKUP(D3,Virksomhed!A4:A6,Virksomhed!S4:S6),\"\")","v":""}]
[{"$f":"IF(E66<>0,\"Feriepenge efter skat\"&REPT(\".\",200),\"\")","v":""},null,{"$f":"C51+E53*(B11=\"Feriepenge\")","v":0},{"$f":"LOOKUP(A7,Lønmodtager!A4:A100,Lønmodtager!AH4:AH100)","v":0},0,null,null,"——————————"]
[{"$f":"IF(E67<>0,\"Udbetalt løn incl. skattefri udbetalinger & reguleringer\"&REPT(\".\",200),\"\")","v":""},null,{"$f":"E53*(B11<>\"Feriepenge\")","v":0},{"$f":"LOOKUP(A7,Lønmodtager!A4:A100,Lønmodtager!AI4:AI100)","v":0},0,null,{"$f":"IF(H67<>0,\"Tjek\",\"\")","v":""},{"$f":"SUM(H14:H66)-H56-H59-H61-H64-H65","v":0},{"$f":"IF(TRUNC(H67*100)<>0,\" Fejl\",IF(H67=0,\"\",\" OK\"))","v":""}]
[{"$f":"IF(E68<>0,\"Antal gange dagpengegodtgørelse\"&REPT(\".\",200),\"\")","v":""},null,{"$f":"IF(D31=0,0,1)*IF(C18<0,-1,1)","v":0},{"$f":"LOOKUP(A7,Lønmodtager!A4:A100,Lønmodtager!AJ4:AJ100)","v":0},0]
[{"$f":"IF(E69<>0,\"Skattefri befordringsgodtgørelse kr.\"&REPT(\".\",200),\"\")","v":""},null,{"$f":"E40","v":""},{"$f":"LOOKUP(A7,Lønmodtager!A4:A100,Lønmodtager!AK4:AK100)","v":0},{"$f":"SUM(C69:D69)","v":0},{"$f":"REPT(F9,1)","v":"31-01-2019"},{"$f":"G53","v":""},{"$f":"-H53","v":0},{"$f":"IF(H69<>0,LOOKUP(D3,Virksomhed!A4:A6,Virksomhed!W4:W6),\"\")","v":""}]
[{"$f":"IF(E70<>0,\"Skattefri befordringsgodtgørelse km.\"&REPT(\".\",200),\"\")","v":""},null,{"$f":"SUM(C40)","v":0},{"$f":"LOOKUP(A7,Lønmodtager!A4:A100,Lønmodtager!AL4:AL100)","v":0},0,"løn hævet"]
[{"$f":"IF(E71<>0,\"Lønindeholdelse\"&REPT(\".\",200),\"\")","v":""},null,{"$f":"-E41","v":0},{"$f":"LOOKUP(A7,Lønmodtager!A4:A100,Lønmodtager!AM4:AM100)","v":0},0]
[{"$f":"IF(E72<>0,\"Saldo SøgneHelligdagsbetaling\"&REPT(\".\",200),\"\")","v":""},null,{"$f":"B51","v":0},{"$f":"LOOKUP(A7,Lønmodtager!A4:A100,Lønmodtager!U4:U100)-LOOKUP(A7,Lønmodtager!A4:A100,Lønmodtager!V4:V100)","v":0},0]
[{"$f":"IF(E73<>0,\"Skattefri Rejsegodtgørelse\"&REPT(\".\",200),\"\")","v":""},null,{"$f":"B58","v":0},{"$f":"LOOKUP(A7,Lønmodtager!A4:A100,Lønmodtager!AP4:AP100)","v":0},0]
[{"$f":"IF(E74<>0,\"B-Indkomst\"&REPT(\".\",200),\"\")","v":""},null,{"$f":"IF(L_NPER=\"B-Indkomst\",E30,0)","v":0},{"$f":"LOOKUP(A7,Lønmodtager!A4:A100,Lønmodtager!AQ4:AQ100)","v":0},0,{"$f":"IF(P118<>0,\"Feriepengeafregning :\",\"\")","v":""},null,{"$f":"IF(J118<>0,\"Cpr-nr.\",\"\")","v":""},{"$f":"IF(J118<>0,\"Feriedage\",\"\")","v":""},{"$f":"IF(J118<>0,\"Feriepenge\",\"\")","v":""},{"$f":"IF(K118<>0,\"Sky.SH-Betaling\",\"\")","v":""},{"$f":"IF(P113<>0,\"Feriepengeafregning :\",\"\")","v":""},null,{"$f":"IF(P113<>0,\"Cpr-nr.\",\"\")","v":""},{"$f":"IF(P113<>0,\"Feriedage\",\"\")","v":""},{"$f":"IF(P113<>0,\"Feriepenge\",\"\")","v":""},{"$f":"IF(Q113<>0,\"Sky.SH-Betaling\",\"\")","v":""}]
[{"$f":"IF(E75<>0,\"Fri Bil, Multimediebeskatning, Ferietillæg ol. \"&\"medtaget i AM-indkomst\"&REPT(\".\",200),\"\")","v":""},null,{"$f":"C22","v":0},{"$f":"LOOKUP(A7,Lønmodtager!A4:A100,Lønmodtager!AR4:AR100)","v":0},0]
["Månedlig Afregning A-skat/AM/SP-bidrag & Pension",null,"Perioden","Summeret","Afregning"]
[{"$f":"IF(E77<>0,\"AM-bidrag\"&REPT(\".\",200),\"\")","v":""},null,{"$f":"C61","v":0},0,{"$f":"SUM(C77:D77)","v":0},{"$f":"IF(Lønmodtager!A25=\"ÅÅÅ\",\"\",Lønmodtager!A25&REPT(\".\",200))","v":""},null,{"$f":"IF(F77<>\"\",Lønmodtager!H25,\"\")","v":""},{"$f":"Lønmodtager!M25","v":0},{"$f":"Lønmodtager!L25","v":0},{"$f":"Lønmodtager!U25-Lønmodtager!V25","v":0},{"$f":"IF(Lønmodtager!A65=\"ÅÅÅ\",\"\",Lønmodtager!A65&REPT(\".\",200))","v":""},null,{"$f":"IF(L77<>\"\",Lønmodtager!H65,\"\")","v":""},{"$f":"Lønmodtager!M65","v":0},{"$f":"Lønmodtager!L65","v":0},{"$f":"Lønmodtager!U65-Lønmodtager!V65","v":0}]
[{"$f":"IF(E78<>0,\"A-skat\"&REPT(\".\",200),\"\")","v":""},null,{"$f":"C62","v":0},0,{"$f":"SUM(C78:D78)","v":0},{"$f":"IF(Lønmodtager!A26=\"ÅÅÅ\",\"\",Lønmodtager!A26&REPT(\".\",200))","v":""},null,{"$f":"IF(F78<>\"\",Lønmodtager!H26,\"\")","v":""},{"$f":"Lønmodtager!M26","v":0},{"$f":"Lønmodtager!L26","v":0},{"$f":"Lønmodtager!U26-Lønmodtager!V26","v":0},{"$f":"IF(Lønmodtager!A66=\"ÅÅÅ\",\"\",Lønmodtager!A66&REPT(\".\",200))","v":""},null,{"$f":"IF(L78<>\"\",Lønmodtager!H66,\"\")","v":""},{"$f":"Lønmodtager!M66","v":0},{"$f":"Lønmodtager!L66","v":0},{"$f":"Lønmodtager!U66-Lønmodtager!V66","v":0}]
[{"$f":"IF(E79<>0,\"SP-bidrag\"&REPT(\".\",200),\"\")","v":""},null,{"$f":"C63","v":0},0,{"$f":"SUM(C79:D79)","v":0},{"$f":"IF(Lønmodtager!A27=\"ÅÅÅ\",\"\",Lønmodtager!A27&REPT(\".\",200))","v":""},null,{"$f":"IF(F79<>\"\",Lønmodtager!H27,\"\")","v":""},{"$f":"Lønmodtager!M27","v":0},{"$f":"Lønmodtager!L27","v":0},{"$f":"Lønmodtager!U27-Lønmodtager!V27","v":0},{"$f":"IF(Lønmodtager!A67=\"ÅÅÅ\",\"\",Lønmodtager!A67&REPT(\".\",200))","v":""},null,{"$f":"IF(L79<>\"\",Lønmodtager!H67,\"\")","v":""},{"$f":"Lønmodtager!M67","v":0},{"$f":"Lønmodtager!L67","v":0},{"$f":"Lønmodtager!U67-Lønmodtager!V67","v":0}]
[{"$f":"IF(E80<>0,\"Pensionsbidrag lønmodtager + arb.giver\"&REPT(\".\",100),\"\")","v":""},null,{"$f":"C64","v":0},0,{"$f":"SUM(C80:D80)","v":0},{"$f":"IF(Lønmodtager!A28=\"ÅÅÅ\",\"\",Lønmodtager!A28&REPT(\".\",200))","v":""},null,{"$f":"IF(F80<>\"\",Lønmodtager!H28,\"\")","v":""},{"$f":"Lønmodtager!M28","v":0},{"$f":"Lønmodtager!L28","v":0},{"$f":"Lønmodtager!U28-Lønmodtager!V28","v":0},{"$f":"IF(Lønmodtager!A68=\"ÅÅÅ\",\"\",Lønmodtager!A68&REPT(\".\",200))","v":""},null,{"$f":"IF(L80<>\"\",Lønmodtager!H68,\"\")","v":""},{"$f":"Lønmodtager!M68","v":0},{"$f":"Lønmodtager!L68","v":0},{"$f":"Lønmodtager!U68-Lønmodtager!V68","v":0}]
[{"$f":"IF(C81<>0,\"Indberetning af månedlig AM + SP bidrag \"&REPT(\".\",200),\"\")","v":""},null,{"$f":"E77+E79","v":0},{"$f":"IF(E81<>0,\"Sum indb.\",\"\")","v":""},{"$f":"SUM(E76:E80)","v":0},{"$f":"IF(Lønmodtager!A29=\"ÅÅÅ\",\"\",Lønmodtager!A29&REPT(\".\",200))","v":""},null,{"$f":"IF(F81<>\"\",Lønmodtager!H29,\"\")","v":""},{"$f":"Lønmodtager!M29","v":0},{"$f":"Lønmodtager!L29","v":0},{"$f":"Lønmodtager!U29-Lønmodtager!V29","v":0},{"$f":"IF(Lønmodtager!A69=\"ÅÅÅ\",\"\",Lønmodtager!A69&REPT(\".\",200))","v":""},null,{"$f":"IF(L81<>\"\",Lønmodtager!H69,\"\")","v":""},{"$f":"Lønmodtager!M69","v":0},{"$f":"Lønmodtager!L69","v":0},{"$f":"Lønmodtager!U69-Lønmodtager!V69","v":0}]
[null,null,null,null,null,{"$f":"IF(Lønmodtager!A30=\"ÅÅÅ\",\"\",Lønmodtager!A30&REPT(\".\",200))","v":""},null,{"$f":"IF(F82<>\"\",Lønmodtager!H30,\"\")","v":""},{"$f":"Lønmodtager!M30","v":0},{"$f":"Lønmodtager!L30","v":0},{"$f":"Lønmodtager!U30-Lønmodtager!V30","v":0},{"$f":"IF(Lønmodtager!A70=\"ÅÅÅ\",\"\",Lønmodtager!A70&REPT(\".\",200))","v":""},null,{"$f":"IF(L82<>\"\",Lønmodtager!H70,\"\")","v":""},{"$f":"Lønmodtager!M70","v":0},{"$f":"Lønmodtager!L70","v":0},{"$f":"Lønmodtager!U70-Lønmodtager!V70","v":0}]
["KvartalsAfregning ATP & Feriepenge ",null,"Perioden","Summeret","Afregning",{"$f":"IF(Lønmodtager!A31=\"ÅÅÅ\",\"\",Lønmodtager!A31&REPT(\".\",200))","v":""},null,{"$f":"IF(F83<>\"\",Lønmodtager!H31,\"\")","v":""},{"$f":"Lønmodtager!M31","v":0},{"$f":"Lønmodtager!L31","v":0},{"$f":"Lønmodtager!U31-Lønmodtager!V31","v":0},{"$f":"IF(Lønmodtager!A71=\"ÅÅÅ\",\"\",Lønmodtager!A71&REPT(\".\",200))","v":""},null,{"$f":"IF(L83<>\"\",Lønmodtager!H71,\"\")","v":""},{"$f":"Lønmodtager!M71","v":0},{"$f":"Lønmodtager!L71","v":0},{"$f":"Lønmodtager!U71-Lønmodtager!V71","v":0}]
[{"$f":"IF(E84<>0,\"ATP lønmodtager + arbejdsgiver\"&REPT(\".\",200),\"\")","v":""},null,{"$f":"C65","v":0},0,{"$f":"SUM(C84:D84)","v":0},{"$f":"IF(Lønmodtager!A32=\"ÅÅÅ\",\"\",Lønmodtager!A32&REPT(\".\",200))","v":""},null,{"$f":"IF(F84<>\"\",Lønmodtager!H32,\"\")","v":""},{"$f":"Lønmodtager!M32","v":0},{"$f":"Lønmodtager!L32","v":0},{"$f":"Lønmodtager!U32-Lønmodtager!V32","v":0},{"$f":"IF(Lønmodtager!A72=\"ÅÅÅ\",\"\",Lønmodtager!A72&REPT(\".\",200))","v":""},null,{"$f":"IF(L84<>\"\",Lønmodtager!H72,\"\")","v":""},{"$f":"Lønmodtager!M72","v":0},{"$f":"Lønmodtager!L72","v":0},{"$f":"Lønmodtager!U72-Lønmodtager!V72","v":0}]
[{"$f":"IF(E85<>0,\"Feriepenge\"&REPT(\".\",200),\"\")","v":""},null,{"$f":"C66","v":0},0,{"$f":"SUM(C85:D85)","v":0},{"$f":"IF(Lønmodtager!A33=\"ÅÅÅ\",\"\",Lønmodtager!A33&REPT(\".\",200))","v":""},null,{"$f":"IF(F85<>\"\",Lønmodtager!H33,\"\")","v":""},{"$f":"Lønmodtager!M33","v":0},{"$f":"Lønmodtager!L33","v":0},{"$f":"Lønmodtager!U33-Lønmodtager!V33","v":0},{"$f":"IF(Lønmodtager!A73=\"ÅÅÅ\",\"\",Lønmodtager!A73&REPT(\".\",200))","v":""},null,{"$f":"IF(L85<>\"\",Lønmodtager!H73,\"\")","v":""},{"$f":"Lønmodtager!M73","v":0},{"$f":"Lønmodtager!L73","v":0},{"$f":"Lønmodtager!U73-Lønmodtager!V73","v":0}]
[null,null,null,null,null,{"$f":"IF(Lønmodtager!A34=\"ÅÅÅ\",\"\",Lønmodtager!A34&REPT(\".\",200))","v":""},null,{"$f":"IF(F86<>\"\",Lønmodtager!H34,\"\")","v":""},{"$f":"Lønmodtager!M34","v":0},{"$f":"Lønmodtager!L34","v":0},{"$f":"Lønmodtager!U34-Lønmodtager!V34","v":0},{"$f":"IF(Lønmodtager!A74=\"ÅÅÅ\",\"\",Lønmodtager!A74&REPT(\".\",200))","v":""},null,{"$f":"IF(L86<>\"\",Lønmodtager!H74,\"\")","v":""},{"$f":"Lønmodtager!M74","v":0},{"$f":"Lønmodtager!L74","v":0},{"$f":"Lønmodtager!U74-Lønmodtager!V74","v":0}]
["SøgneHelligdagsbetaling beregnet hele året",null,"Perioden","År-Til-Dato","År-Til-Dato",{"$f":"IF(Lønmodtager!A35=\"ÅÅÅ\",\"\",Lønmodtager!A35&REPT(\".\",200))","v":""},null,{"$f":"IF(F87<>\"\",Lønmodtager!H35,\"\")","v":""},{"$f":"Lønmodtager!M35","v":0},{"$f":"Lønmodtager!L35","v":0},{"$f":"Lønmodtager!U35-Lønmodtager!V35","v":0},{"$f":"IF(Lønmodtager!A75=\"ÅÅÅ\",\"\",Lønmodtager!A75&REPT(\".\",200))","v":""},null,{"$f":"IF(L87<>\"\",Lønmodtager!H75,\"\")","v":""},{"$f":"Lønmodtager!M75","v":0},{"$f":"Lønmodtager!L75","v":0},{"$f":"Lønmodtager!U75-Lønmodtager!V75","v":0}]
[{"$f":"IF(E88<>0,\"SøgneHelligdagsbetaling\"&REPT(\".\",200),\"\")","v":""},null,{"$f":"C72","v":0},null,{"$f":"SUM(C88:D88)","v":0},{"$f":"IF(Lønmodtager!A36=\"ÅÅÅ\",\"\",Lønmodtager!A36&REPT(\".\",200))","v":""},null,{"$f":"IF(F88<>\"\",Lønmodtager!H36,\"\")","v":""},{"$f":"Lønmodtager!M36","v":0},{"$f":"Lønmodtager!L36","v":0},{"$f":"Lønmodtager!U36-Lønmodtager!V36","v":0},{"$f":"IF(Lønmodtager!A76=\"ÅÅÅ\",\"\",Lønmodtager!A76&REPT(\".\",200))","v":""},null,{"$f":"IF(L88<>\"\",Lønmodtager!H76,\"\")","v":""},{"$f":"Lønmodtager!M76","v":0},{"$f":"Lønmodtager!L76","v":0},{"$f":"Lønmodtager!U76-Lønmodtager!V76","v":0}]
[null,null,null,null,null,{"$f":"IF(Lønmodtager!A37=\"ÅÅÅ\",\"\",Lønmodtager!A37&REPT(\".\",200))","v":""},null,{"$f":"IF(F89<>\"\",Lønmodtager!H37,\"\")","v":""},{"$f":"Lønmodtager!M37","v":0},{"$f":"Lønmodtager!L37","v":0},{"$f":"Lønmodtager!U37-Lønmodtager!V37","v":0},{"$f":"IF(Lønmodtager!A77=\"ÅÅÅ\",\"\",Lønmodtager!A77&REPT(\".\",200))","v":""},null,{"$f":"IF(L89<>\"\",Lønmodtager!H77,\"\")","v":""},{"$f":"Lønmodtager!M77","v":0},{"$f":"Lønmodtager!L77","v":0},{"$f":"Lønmodtager!U77-Lønmodtager!V77","v":0}]
[{"$f":"D2&TEXT(E2,\"STANDARD\")","v":"SE-NR..........................12 34 56 78"},null,null,null,null,{"$f":"IF(Lønmodtager!A38=\"ÅÅÅ\",\"\",Lønmodtager!A38&REPT(\".\",200))","v":""},null,{"$f":"IF(F90<>\"\",Lønmodtager!H38,\"\")","v":""},{"$f":"Lønmodtager!M38","v":0},{"$f":"Lønmodtager!L38","v":0},{"$f":"Lønmodtager!U38-Lønmodtager!V38","v":0},{"$f":"IF(Lønmodtager!A78=\"ÅÅÅ\",\"\",Lønmodtager!A78&REPT(\".\",200))","v":""},null,{"$f":"IF(L90<>\"\",Lønmodtager!H78,\"\")","v":""},{"$f":"Lønmodtager!M78","v":0},{"$f":"Lønmodtager!L78","v":0},{"$f":"Lønmodtager!U78-Lønmodtager!V78","v":0}]
[{"$f":"D3","v":"TestVirk.navn"},null,null,null,null,{"$f":"IF(Lønmodtager!A39=\"ÅÅÅ\",\"\",Lønmodtager!A39&REPT(\".\",200))","v":""},null,{"$f":"IF(F91<>\"\",Lønmodtager!H39,\"\")","v":""},{"$f":"Lønmodtager!M39","v":0},{"$f":"Lønmodtager!L39","v":0},{"$f":"Lønmodtager!U39-Lønmodtager!V39","v":0},{"$f":"IF(Lønmodtager!A79=\"ÅÅÅ\",\"\",Lønmodtager!A79&REPT(\".\",200))","v":""},null,{"$f":"IF(L91<>\"\",Lønmodtager!H79,\"\")","v":""},{"$f":"Lønmodtager!M79","v":0},{"$f":"Lønmodtager!L79","v":0},{"$f":"Lønmodtager!U79-Lønmodtager!V79","v":0}]
[{"$f":"D4","v":"v/Test.Indehaver"},null,null,null,null,{"$f":"IF(Lønmodtager!A40=\"ÅÅÅ\",\"\",Lønmodtager!A40&REPT(\".\",200))","v":""},null,{"$f":"IF(F92<>\"\",Lønmodtager!H40,\"\")","v":""},{"$f":"Lønmodtager!M40","v":0},{"$f":"Lønmodtager!L40","v":0},{"$f":"Lønmodtager!U40-Lønmodtager!V40","v":0},{"$f":"IF(Lønmodtager!A80=\"ÅÅÅ\",\"\",Lønmodtager!A80&REPT(\".\",200))","v":""},null,{"$f":"IF(L92<>\"\",Lønmodtager!H80,\"\")","v":""},{"$f":"Lønmodtager!M80","v":0},{"$f":"Lønmodtager!L80","v":0},{"$f":"Lønmodtager!U80-Lønmodtager!V80","v":0}]
[{"$f":"D5","v":"Test.Adr.Virk"},null,null,null,null,{"$f":"IF(Lønmodtager!A41=\"ÅÅÅ\",\"\",Lønmodtager!A41&REPT(\".\",200))","v":""},null,{"$f":"IF(F93<>\"\",Lønmodtager!H41,\"\")","v":""},{"$f":"Lønmodtager!M41","v":0},{"$f":"Lønmodtager!L41","v":0},{"$f":"Lønmodtager!U41-Lønmodtager!V41","v":0},{"$f":"IF(Lønmodtager!A81=\"ÅÅÅ\",\"\",Lønmodtager!A81&REPT(\".\",200))","v":""},null,{"$f":"IF(L93<>\"\",Lønmodtager!H81,\"\")","v":""},{"$f":"Lønmodtager!M81","v":0},{"$f":"Lønmodtager!L81","v":0},{"$f":"Lønmodtager!U81-Lønmodtager!V81","v":0}]
[{"$f":"D6","v":"1234 Testby"},null,null,null,null,{"$f":"IF(Lønmodtager!A42=\"ÅÅÅ\",\"\",Lønmodtager!A42&REPT(\".\",200))","v":""},null,{"$f":"IF(F94<>\"\",Lønmodtager!H42,\"\")","v":""},{"$f":"Lønmodtager!M42","v":0},{"$f":"Lønmodtager!L42","v":0},{"$f":"Lønmodtager!U42-Lønmodtager!V42","v":0},{"$f":"IF(Lønmodtager!A82=\"ÅÅÅ\",\"\",Lønmodtager!A82&REPT(\".\",200))","v":""},null,{"$f":"IF(L94<>\"\",Lønmodtager!H82,\"\")","v":""},{"$f":"Lønmodtager!M82","v":0},{"$f":"Lønmodtager!L82","v":0},{"$f":"Lønmodtager!U82-Lønmodtager!V82","v":0}]
[null,null,null,null,null,{"$f":"IF(Lønmodtager!A43=\"ÅÅÅ\",\"\",Lønmodtager!A43&REPT(\".\",200))","v":""},null,{"$f":"IF(F95<>\"\",Lønmodtager!H43,\"\")","v":""},{"$f":"Lønmodtager!M43","v":0},{"$f":"Lønmodtager!L43","v":0},{"$f":"Lønmodtager!U43-Lønmodtager!V43","v":0},{"$f":"IF(Lønmodtager!A83=\"ÅÅÅ\",\"\",Lønmodtager!A83&REPT(\".\",200))","v":""},null,{"$f":"IF(L95<>\"\",Lønmodtager!H83,\"\")","v":""},{"$f":"Lønmodtager!M83","v":0},{"$f":"Lønmodtager!L83","v":0},{"$f":"Lønmodtager!U83-Lønmodtager!V83","v":0}]
["Feriepengeafregning :","Cpr-nr.","Feriedage","Feriepenge","Sky.SH-betaling",{"$f":"IF(Lønmodtager!A44=\"ÅÅÅ\",\"\",Lønmodtager!A44&REPT(\".\",200))","v":""},null,{"$f":"IF(F96<>\"\",Lønmodtager!H44,\"\")","v":""},{"$f":"Lønmodtager!M44","v":0},{"$f":"Lønmodtager!L44","v":0},{"$f":"Lønmodtager!U44-Lønmodtager!V44","v":0},{"$f":"IF(Lønmodtager!A84=\"ÅÅÅ\",\"\",Lønmodtager!A84&REPT(\".\",200))","v":""},null,{"$f":"IF(L96<>\"\",Lønmodtager!H84,\"\")","v":""},{"$f":"Lønmodtager!M84","v":0},{"$f":"Lønmodtager!L84","v":0},{"$f":"Lønmodtager!U84-Lønmodtager!V84","v":0}]
[{"$f":"IF(Lønmodtager!A5=\"ÅÅÅ\",\"\",Lønmodtager!A5&REPT(\".\",200))","v":"Søgenavn indtastes i celle F7........................................................................................................................................................................................................"},{"$f":"IF(Lønmodtager!A5=\"ÅÅÅ\",\"\",Lønmodtager!H5&REPT(\".\",200))","v":"000000-0000........................................................................................................................................................................................................"},{"$f":"Lønmodtager!M5","v":0},{"$f":"Lønmodtager!L5","v":0},{"$f":"Lønmodtager!U5-Lønmodtager!V5","v":0},{"$f":"IF(Lønmodtager!A45=\"ÅÅÅ\",\"\",Lønmodtager!A45&REPT(\".\",200))","v":""},null,{"$f":"IF(F97<>\"\",Lønmodtager!H45,\"\")","v":""},{"$f":"Lønmodtager!M45","v":0},{"$f":"Lønmodtager!L45","v":0},{"$f":"Lønmodtager!U45-Lønmodtager!V45","v":0},{"$f":"IF(Lønmodtager!A85=\"ÅÅÅ\",\"\",Lønmodtager!A85&REPT(\".\",200))","v":""},null,{"$f":"IF(L97<>\"\",Lønmodtager!H85,\"\")","v":""},{"$f":"Lønmodtager!M85","v":0},{"$f":"Lønmodtager!L85","v":0},{"$f":"Lønmodtager!U85-Lønmodtager!V85","v":0}]
[{"$f":"IF(Lønmodtager!A6=\"ÅÅÅ\",\"\",Lønmodtager!A6&REPT(\".\",200))","v":"Testperson........................................................................................................................................................................................................"},{"$f":"IF(Lønmodtager!A6=\"ÅÅÅ\",\"\",Lønmodtager!H6&REPT(\".\",200))","v":"12345678-1234........................................................................................................................................................................................................"},{"$f":"Lønmodtager!M6","v":0},{"$f":"Lønmodtager!L6","v":0},{"$f":"Lønmodtager!U6-Lønmodtager!V6","v":0},{"$f":"IF(Lønmodtager!A46=\"ÅÅÅ\",\"\",Lønmodtager!A46&REPT(\".\",200))","v":""},null,{"$f":"IF(F98<>\"\",Lønmodtager!H46,\"\")","v":""},{"$f":"Lønmodtager!M46","v":0},{"$f":"Lønmodtager!L46","v":0},{"$f":"Lønmodtager!U46-Lønmodtager!V46","v":0},{"$f":"IF(Lønmodtager!A86=\"ÅÅÅ\",\"\",Lønmodtager!A86&REPT(\".\",200))","v":""},null,{"$f":"IF(L98<>\"\",Lønmodtager!H86,\"\")","v":""},{"$f":"Lønmodtager!M86","v":0},{"$f":"Lønmodtager!L86","v":0},{"$f":"Lønmodtager!U86-Lønmodtager!V86","v":0}]
[{"$f":"IF(Lønmodtager!A7=\"ÅÅÅ\",\"\",Lønmodtager!A7&REPT(\".\",200))","v":""},{"$f":"IF(Lønmodtager!A7=\"ÅÅÅ\",\"\",Lønmodtager!H7&REPT(\".\",200))","v":""},{"$f":"Lønmodtager!M7","v":0},{"$f":"Lønmodtager!L7","v":0},{"$f":"Lønmodtager!U7-Lønmodtager!V7","v":0},{"$f":"IF(Lønmodtager!A47=\"ÅÅÅ\",\"\",Lønmodtager!A47&REPT(\".\",200))","v":""},null,{"$f":"IF(F99<>\"\",Lønmodtager!H47,\"\")","v":""},{"$f":"Lønmodtager!M47","v":0},{"$f":"Lønmodtager!L47","v":0},{"$f":"Lønmodtager!U47-Lønmodtager!V47","v":0},{"$f":"IF(Lønmodtager!A87=\"ÅÅÅ\",\"\",Lønmodtager!A87&REPT(\".\",200))","v":""},null,{"$f":"IF(L99<>\"\",Lønmodtager!H87,\"\")","v":""},{"$f":"Lønmodtager!M87","v":0},{"$f":"Lønmodtager!L87","v":0},{"$f":"Lønmodtager!U87-Lønmodtager!V87","v":0}]
[{"$f":"IF(Lønmodtager!A8=\"ÅÅÅ\",\"\",Lønmodtager!A8&REPT(\".\",200))","v":""},{"$f":"IF(Lønmodtager!A8=\"ÅÅÅ\",\"\",Lønmodtager!H8&REPT(\".\",200))","v":""},{"$f":"Lønmodtager!M8","v":0},{"$f":"Lønmodtager!L8","v":0},{"$f":"Lønmodtager!U8-Lønmodtager!V8","v":0},{"$f":"IF(Lønmodtager!A48=\"ÅÅÅ\",\"\",Lønmodtager!A48&REPT(\".\",200))","v":""},null,{"$f":"IF(F100<>\"\",Lønmodtager!H48,\"\")","v":""},{"$f":"Lønmodtager!M48","v":0},{"$f":"Lønmodtager!L48","v":0},{"$f":"Lønmodtager!U48-Lønmodtager!V48","v":0},{"$f":"IF(Lønmodtager!A88=\"ÅÅÅ\",\"\",Lønmodtager!A88&REPT(\".\",200))","v":""},null,{"$f":"IF(L100<>\"\",Lønmodtager!H88,\"\")","v":""},{"$f":"Lønmodtager!M88","v":0},{"$f":"Lønmodtager!L88","v":0},{"$f":"Lønmodtager!U88-Lønmodtager!V88","v":0}]
[{"$f":"IF(Lønmodtager!A9=\"ÅÅÅ\",\"\",Lønmodtager!A9&REPT(\".\",200))","v":""},{"$f":"IF(Lønmodtager!A9=\"ÅÅÅ\",\"\",Lønmodtager!H9&REPT(\".\",200))","v":""},{"$f":"Lønmodtager!M9","v":0},{"$f":"Lønmodtager!L9","v":0},{"$f":"Lønmodtager!U9-Lønmodtager!V9","v":0},{"$f":"IF(Lønmodtager!A49=\"ÅÅÅ\",\"\",Lønmodtager!A49&REPT(\".\",200))","v":""},null,{"$f":"IF(F101<>\"\",Lønmodtager!H49,\"\")","v":""},{"$f":"Lønmodtager!M49","v":0},{"$f":"Lønmodtager!L49","v":0},{"$f":"Lønmodtager!U49-Lønmodtager!V49","v":0},{"$f":"IF(Lønmodtager!A89=\"ÅÅÅ\",\"\",Lønmodtager!A89&REPT(\".\",200))","v":""},null,{"$f":"IF(L101<>\"\",Lønmodtager!H89,\"\")","v":""},{"$f":"Lønmodtager!M89","v":0},{"$f":"Lønmodtager!L89","v":0},{"$f":"Lønmodtager!U89-Lønmodtager!V89","v":0}]
[{"$f":"IF(Lønmodtager!A10=\"ÅÅÅ\",\"\",Lønmodtager!A10&REPT(\".\",200))","v":""},{"$f":"IF(Lønmodtager!A10=\"ÅÅÅ\",\"\",Lønmodtager!H10&REPT(\".\",200))","v":""},{"$f":"Lønmodtager!M10","v":0},{"$f":"Lønmodtager!L10","v":0},{"$f":"Lønmodtager!U10-Lønmodtager!V10","v":0},{"$f":"IF(Lønmodtager!A50=\"ÅÅÅ\",\"\",Lønmodtager!A50&REPT(\".\",200))","v":""},null,{"$f":"IF(F102<>\"\",Lønmodtager!H50,\"\")","v":""},{"$f":"Lønmodtager!M50","v":0},{"$f":"Lønmodtager!L50","v":0},{"$f":"Lønmodtager!U50-Lønmodtager!V50","v":0},{"$f":"IF(Lønmodtager!A90=\"ÅÅÅ\",\"\",Lønmodtager!A90&REPT(\".\",200))","v":""},null,{"$f":"IF(L102<>\"\",Lønmodtager!H90,\"\")","v":""},{"$f":"Lønmodtager!M90","v":0},{"$f":"Lønmodtager!L90","v":0},{"$f":"Lønmodtager!U90-Lønmodtager!V90","v":0}]
[{"$f":"IF(Lønmodtager!A11=\"ÅÅÅ\",\"\",Lønmodtager!A11&REPT(\".\",200))","v":""},{"$f":"IF(Lønmodtager!A11=\"ÅÅÅ\",\"\",Lønmodtager!H11&REPT(\".\",200))","v":""},{"$f":"Lønmodtager!M11","v":0},{"$f":"Lønmodtager!L11","v":0},{"$f":"Lønmodtager!U11-Lønmodtager!V11","v":0},{"$f":"IF(Lønmodtager!A51=\"ÅÅÅ\",\"\",Lønmodtager!A51&REPT(\".\",200))","v":""},null,{"$f":"IF(F103<>\"\",Lønmodtager!H51,\"\")","v":""},{"$f":"Lønmodtager!M51","v":0},{"$f":"Lønmodtager!L51","v":0},{"$f":"Lønmodtager!U51-Lønmodtager!V51","v":0},{"$f":"IF(Lønmodtager!A91=\"ÅÅÅ\",\"\",Lønmodtager!A91&REPT(\".\",200))","v":""},null,{"$f":"IF(L103<>\"\",Lønmodtager!H91,\"\")","v":""},{"$f":"Lønmodtager!M91","v":0},{"$f":"Lønmodtager!L91","v":0},{"$f":"Lønmodtager!U91-Lønmodtager!V91","v":0}]
[{"$f":"IF(Lønmodtager!A12=\"ÅÅÅ\",\"\",Lønmodtager!A12&REPT(\".\",200))","v":""},{"$f":"IF(Lønmodtager!A12=\"ÅÅÅ\",\"\",Lønmodtager!H12&REPT(\".\",200))","v":""},{"$f":"Lønmodtager!M12","v":0},{"$f":"Lønmodtager!L12","v":0},{"$f":"Lønmodtager!U12-Lønmodtager!V12","v":0},{"$f":"IF(Lønmodtager!A52=\"ÅÅÅ\",\"\",Lønmodtager!A52&REPT(\".\",200))","v":""},null,{"$f":"IF(F104<>\"\",Lønmodtager!H52,\"\")","v":""},{"$f":"Lønmodtager!M52","v":0},{"$f":"Lønmodtager!L52","v":0},{"$f":"Lønmodtager!U52-Lønmodtager!V52","v":0},{"$f":"IF(Lønmodtager!A92=\"ÅÅÅ\",\"\",Lønmodtager!A92&REPT(\".\",200))","v":""},null,{"$f":"IF(L104<>\"\",Lønmodtager!H92,\"\")","v":""},{"$f":"Lønmodtager!M92","v":0},{"$f":"Lønmodtager!L92","v":0},{"$f":"Lønmodtager!U92-Lønmodtager!V92","v":0}]
[{"$f":"IF(Lønmodtager!A13=\"ÅÅÅ\",\"\",Lønmodtager!A13&REPT(\".\",200))","v":""},{"$f":"IF(Lønmodtager!A13=\"ÅÅÅ\",\"\",Lønmodtager!H13&REPT(\".\",200))","v":""},{"$f":"Lønmodtager!M13","v":0},{"$f":"Lønmodtager!L13","v":0},{"$f":"Lønmodtager!U13-Lønmodtager!V13","v":0},{"$f":"IF(Lønmodtager!A53=\"ÅÅÅ\",\"\",Lønmodtager!A53&REPT(\".\",200))","v":""},null,{"$f":"IF(F105<>\"\",Lønmodtager!H53,\"\")","v":""},{"$f":"Lønmodtager!M53","v":0},{"$f":"Lønmodtager!L53","v":0},{"$f":"Lønmodtager!U53-Lønmodtager!V53","v":0},{"$f":"IF(Lønmodtager!A93=\"ÅÅÅ\",\"\",Lønmodtager!A93&REPT(\".\",200))","v":""},null,{"$f":"IF(L105<>\"\",Lønmodtager!H93,\"\")","v":""},{"$f":"Lønmodtager!M93","v":0},{"$f":"Lønmodtager!L93","v":0},{"$f":"Lønmodtager!U93-Lønmodtager!V93","v":0}]
[{"$f":"IF(Lønmodtager!A14=\"ÅÅÅ\",\"\",Lønmodtager!A14&REPT(\".\",200))","v":""},{"$f":"IF(Lønmodtager!A14=\"ÅÅÅ\",\"\",Lønmodtager!H14&REPT(\".\",200))","v":""},{"$f":"Lønmodtager!M14","v":0},{"$f":"Lønmodtager!L14","v":0},{"$f":"Lønmodtager!U14-Lønmodtager!V14","v":0},{"$f":"IF(Lønmodtager!A54=\"ÅÅÅ\",\"\",Lønmodtager!A54&REPT(\".\",200))","v":""},null,{"$f":"IF(F106<>\"\",Lønmodtager!H54,\"\")","v":""},{"$f":"Lønmodtager!M54","v":0},{"$f":"Lønmodtager!L54","v":0},{"$f":"Lønmodtager!U54-Lønmodtager!V54","v":0},{"$f":"IF(Lønmodtager!A94=\"ÅÅÅ\",\"\",Lønmodtager!A94&REPT(\".\",200))","v":""},null,{"$f":"IF(L106<>\"\",Lønmodtager!H94,\"\")","v":""},{"$f":"Lønmodtager!M94","v":0},{"$f":"Lønmodtager!L94","v":0},{"$f":"Lønmodtager!U94-Lønmodtager!V94","v":0}]
[{"$f":"IF(Lønmodtager!A15=\"ÅÅÅ\",\"\",Lønmodtager!A15&REPT(\".\",200))","v":""},{"$f":"IF(Lønmodtager!A15=\"ÅÅÅ\",\"\",Lønmodtager!H15&REPT(\".\",200))","v":""},{"$f":"Lønmodtager!M15","v":0},{"$f":"Lønmodtager!L15","v":0},{"$f":"Lønmodtager!U15-Lønmodtager!V15","v":0},{"$f":"IF(Lønmodtager!A55=\"ÅÅÅ\",\"\",Lønmodtager!A55&REPT(\".\",200))","v":""},null,{"$f":"IF(F107<>\"\",Lønmodtager!H55,\"\")","v":""},{"$f":"Lønmodtager!M55","v":0},{"$f":"Lønmodtager!L55","v":0},{"$f":"Lønmodtager!U55-Lønmodtager!V55","v":0},{"$f":"IF(Lønmodtager!A95=\"ÅÅÅ\",\"\",Lønmodtager!A95&REPT(\".\",200))","v":""},null,{"$f":"IF(L107<>\"\",Lønmodtager!H95,\"\")","v":""},{"$f":"Lønmodtager!M95","v":0},{"$f":"Lønmodtager!L95","v":0},{"$f":"Lønmodtager!U95-Lønmodtager!V95","v":0}]
[{"$f":"IF(Lønmodtager!A16=\"ÅÅÅ\",\"\",Lønmodtager!A16&REPT(\".\",200))","v":""},{"$f":"IF(Lønmodtager!A16=\"ÅÅÅ\",\"\",Lønmodtager!H16&REPT(\".\",200))","v":""},{"$f":"Lønmodtager!M16","v":0},{"$f":"Lønmodtager!L16","v":0},{"$f":"Lønmodtager!U16-Lønmodtager!V16","v":0},{"$f":"IF(Lønmodtager!A56=\"ÅÅÅ\",\"\",Lønmodtager!A56&REPT(\".\",200))","v":""},null,{"$f":"IF(F108<>\"\",Lønmodtager!H56,\"\")","v":""},{"$f":"Lønmodtager!M56","v":0},{"$f":"Lønmodtager!L56","v":0},{"$f":"Lønmodtager!U56-Lønmodtager!V56","v":0},{"$f":"IF(Lønmodtager!A96=\"ÅÅÅ\",\"\",Lønmodtager!A96&REPT(\".\",200))","v":""},null,{"$f":"IF(L108<>\"\",Lønmodtager!H96,\"\")","v":""},{"$f":"Lønmodtager!M96","v":0},{"$f":"Lønmodtager!L96","v":0},{"$f":"Lønmodtager!U96-Lønmodtager!V96","v":0}]
[{"$f":"IF(Lønmodtager!A17=\"ÅÅÅ\",\"\",Lønmodtager!A17&REPT(\".\",200))","v":""},{"$f":"IF(Lønmodtager!A17=\"ÅÅÅ\",\"\",Lønmodtager!H17&REPT(\".\",200))","v":""},{"$f":"Lønmodtager!M17","v":0},{"$f":"Lønmodtager!L17","v":0},{"$f":"Lønmodtager!U17-Lønmodtager!V17","v":0},{"$f":"IF(Lønmodtager!A57=\"ÅÅÅ\",\"\",Lønmodtager!A57&REPT(\".\",200))","v":""},null,{"$f":"IF(F109<>\"\",Lønmodtager!H57,\"\")","v":""},{"$f":"Lønmodtager!M57","v":0},{"$f":"Lønmodtager!L57","v":0},{"$f":"Lønmodtager!U57-Lønmodtager!V57","v":0},{"$f":"IF(Lønmodtager!A97=\"ÅÅÅ\",\"\",Lønmodtager!A97&REPT(\".\",200))","v":""},null,{"$f":"IF(L109<>\"\",Lønmodtager!H97,\"\")","v":""},{"$f":"Lønmodtager!M97","v":0},{"$f":"Lønmodtager!L97","v":0},{"$f":"Lønmodtager!U97-Lønmodtager!V97","v":0}]
[{"$f":"IF(Lønmodtager!A18=\"ÅÅÅ\",\"\",Lønmodtager!A18&REPT(\".\",200))","v":""},{"$f":"IF(Lønmodtager!A18=\"ÅÅÅ\",\"\",Lønmodtager!H18&REPT(\".\",200))","v":""},{"$f":"Lønmodtager!M18","v":0},{"$f":"Lønmodtager!L18","v":0},{"$f":"Lønmodtager!U18-Lønmodtager!V18","v":0},{"$f":"IF(Lønmodtager!A58=\"ÅÅÅ\",\"\",Lønmodtager!A58&REPT(\".\",200))","v":""},null,{"$f":"IF(F110<>\"\",Lønmodtager!H58,\"\")","v":""},{"$f":"Lønmodtager!M58","v":0},{"$f":"Lønmodtager!L58","v":0},{"$f":"Lønmodtager!U58-Lønmodtager!V58","v":0},{"$f":"IF(Lønmodtager!A98=\"ÅÅÅ\",\"\",Lønmodtager!A98&REPT(\".\",200))","v":""},null,{"$f":"IF(L110<>\"\",Lønmodtager!H98,\"\")","v":""},{"$f":"Lønmodtager!M98","v":0},{"$f":"Lønmodtager!L98","v":0},{"$f":"Lønmodtager!U98-Lønmodtager!V98","v":0}]
[{"$f":"IF(Lønmodtager!A19=\"ÅÅÅ\",\"\",Lønmodtager!A19&REPT(\".\",200))","v":""},{"$f":"IF(Lønmodtager!A19=\"ÅÅÅ\",\"\",Lønmodtager!H19&REPT(\".\",200))","v":""},{"$f":"Lønmodtager!M19","v":0},{"$f":"Lønmodtager!L19","v":0},{"$f":"Lønmodtager!U19-Lønmodtager!V19","v":0},{"$f":"IF(Lønmodtager!A59=\"ÅÅÅ\",\"\",Lønmodtager!A59&REPT(\".\",200))","v":""},null,{"$f":"IF(F111<>\"\",Lønmodtager!H59,\"\")","v":""},{"$f":"Lønmodtager!M59","v":0},{"$f":"Lønmodtager!L59","v":0},{"$f":"Lønmodtager!U59-Lønmodtager!V59","v":0},{"$f":"IF(Lønmodtager!A99=\"ÅÅÅ\",\"\",Lønmodtager!A99&REPT(\".\",200))","v":""},null,{"$f":"IF(L111<>\"\",Lønmodtager!H99,\"\")","v":""},{"$f":"Lønmodtager!M99","v":0},{"$f":"Lønmodtager!L99","v":0},{"$f":"Lønmodtager!U99-Lønmodtager!V99","v":0}]
[{"$f":"IF(Lønmodtager!A20=\"ÅÅÅ\",\"\",Lønmodtager!A20&REPT(\".\",200))","v":""},{"$f":"IF(Lønmodtager!A20=\"ÅÅÅ\",\"\",Lønmodtager!H20&REPT(\".\",200))","v":""},{"$f":"Lønmodtager!M20","v":0},{"$f":"Lønmodtager!L20","v":0},{"$f":"Lønmodtager!U20-Lønmodtager!V20","v":0},{"$f":"IF(Lønmodtager!A60=\"ÅÅÅ\",\"\",Lønmodtager!A60&REPT(\".\",200))","v":""},null,{"$f":"IF(F112<>\"\",Lønmodtager!H60,\"\")","v":""},{"$f":"Lønmodtager!M60","v":0},{"$f":"Lønmodtager!L60","v":0},{"$f":"Lønmodtager!U60-Lønmodtager!V60","v":0},null,null,null,null,{"$f":"IF(P113<>0,\"------------\",\"\")","v":""},{"$f":"IF(Q113<>0,\"------------\",\"\")","v":""}]
[{"$f":"IF(Lønmodtager!A21=\"ÅÅÅ\",\"\",Lønmodtager!A21&REPT(\".\",200))","v":""},{"$f":"IF(Lønmodtager!A21=\"ÅÅÅ\",\"\",Lønmodtager!H21&REPT(\".\",200))","v":""},{"$f":"Lønmodtager!M21","v":0},{"$f":"Lønmodtager!L21","v":0},{"$f":"Lønmodtager!U21-Lønmodtager!V21","v":0},{"$f":"IF(Lønmodtager!A61=\"ÅÅÅ\",\"\",Lønmodtager!A61&REPT(\".\",200))","v":""},null,{"$f":"IF(F113<>\"\",Lønmodtager!H61,\"\")","v":""},{"$f":"Lønmodtager!M61","v":0},{"$f":"Lønmodtager!L61","v":0},{"$f":"Lønmodtager!U61-Lønmodtager!V61","v":0},{"$f":"IF(P113+Q113<>0,\"Indbetaling af feriepenge & Skyldig SH\"&REPT(\".\",200),\"\")","v":""},null,null,null,{"$f":"SUM(P77:P111)","v":0},{"$f":"SUM(Q77:Q111)","v":0}]
[{"$f":"IF(Lønmodtager!A22=\"ÅÅÅ\",\"\",Lønmodtager!A22&REPT(\".\",200))","v":""},{"$f":"IF(Lønmodtager!A22=\"ÅÅÅ\",\"\",Lønmodtager!H22&REPT(\".\",200))","v":""},{"$f":"Lønmodtager!M22","v":0},{"$f":"Lønmodtager!L22","v":0},{"$f":"Lønmodtager!U22-Lønmodtager!V22","v":0},{"$f":"IF(Lønmodtager!A62=\"ÅÅÅ\",\"\",Lønmodtager!A62&REPT(\".\",200))","v":""},null,{"$f":"IF(F114<>\"\",Lønmodtager!H62,\"\")","v":""},{"$f":"Lønmodtager!M62","v":0},{"$f":"Lønmodtager!L62","v":0},{"$f":"Lønmodtager!U62-Lønmodtager!V62","v":0}]
[{"$f":"IF(Lønmodtager!A23=\"ÅÅÅ\",\"\",Lønmodtager!A23&REPT(\".\",200))","v":""},{"$f":"IF(Lønmodtager!A23=\"ÅÅÅ\",\"\",Lønmodtager!H23&REPT(\".\",200))","v":""},{"$f":"Lønmodtager!M23","v":0},{"$f":"Lønmodtager!L23","v":0},{"$f":"Lønmodtager!U23-Lønmodtager!V23","v":0},{"$f":"IF(Lønmodtager!A63=\"ÅÅÅ\",\"\",Lønmodtager!A63&REPT(\".\",200))","v":""},null,{"$f":"IF(F115<>\"\",Lønmodtager!H63,\"\")","v":""},{"$f":"Lønmodtager!M63","v":0},{"$f":"Lønmodtager!L63","v":0},{"$f":"Lønmodtager!U63-Lønmodtager!V63","v":0}]
[{"$f":"IF(Lønmodtager!A24=\"ÅÅÅ\",\"\",Lønmodtager!A24&REPT(\".\",200))","v":""},{"$f":"IF(Lønmodtager!A24=\"ÅÅÅ\",\"\",Lønmodtager!H24&REPT(\".\",200))","v":""},{"$f":"Lønmodtager!M24","v":0},{"$f":"Lønmodtager!L24","v":0},{"$f":"Lønmodtager!U24-Lønmodtager!V24","v":0},{"$f":"IF(Lønmodtager!A64=\"ÅÅÅ\",\"\",Lønmodtager!A64&REPT(\".\",200))","v":""},null,{"$f":"IF(F116<>\"\",Lønmodtager!H64,\"\")","v":""},{"$f":"Lønmodtager!M64","v":0},{"$f":"Lønmodtager!L64","v":0},{"$f":"Lønmodtager!U64-Lønmodtager!V64","v":0}]
[null,null,null,{"$f":"IF(D118=0,\"\",\"------------\")","v":""},{"$f":"IF(E118=0,\"\",\"------------\")","v":""},null,null,null,null,{"$f":"IF(J118<>0,\"------------\",\"\")","v":""},{"$f":"IF(K118<>0,\"------------\",\"\")","v":""}]
[{"$f":"IF(D118+E118=0,\"\",\"Indbetaling af Feriepenge & Skyldig SH\"&REPT(\".\",200))","v":""},null,null,{"$f":"SUM(D97:D116)","v":0},{"$f":"SUM(E97:E116)","v":0},{"$f":"IF(J118+K118<>0,\"Indbetaling af Feriepenge & Skyldig SH\"&REPT(\".\",200),\"\")","v":""},null,null,null,{"$f":"SUM(I77:I116)","v":0},{"$f":"SUM(J77:J116)","v":0}]
[]
[]
[]
["Stamdata :","2019"," Årstal på lønsedlen "]
["Intern ATP-Tabel :"]
["Tjek satserne : http://www.atp.dk/web/portal.nsf/mainfrms!readform&Area=ATP"]
["ATP pr. time v/sygedagpenge",1.62," <--- Ophævet pr. 1.7.2002, herefter alm. ATP-beregning"]
[null,null,"Under","ATP-total","ATP/time","Antal feriedage",null,"Fuld Tid Perioden","Timelønnet"]
[{"$f":"\"Månedslønnet\"&REPT(\".\",200)","v":"Månedslønnet........................................................................................................................................................................................................"},"Måned",39,{"$f":"B171","v":284},0,{"$f":"INT(25/12*100)/100*FortegnTimer","v":2.08},null,{"$f":"$B$155*52/12","v":160.33333333333334},{"$f":"IF(K11=1,\"Ja\",\"Nej\")","v":"Ja"}]
[{"$f":"\"14-dages lønnede\"&REPT(\".\",200)","v":"14-dages lønnede........................................................................................................................................................................................................"},"14 DG",18,{"$f":"B172","v":149.4},0,{"$f":"INT(25/26*100)/100*FortegnTimer","v":0.96},null,{"$f":"$B$155*2","v":74}]
[{"$f":"\"Ugelønnede\"&REPT(\".\",200)","v":"Ugelønnede........................................................................................................................................................................................................"},"Uge",9,{"$f":"B173","v":74.7},0,{"$f":"INT(25/52*100)/100*FortegnTimer","v":0.48},null,{"$f":"$B$155","v":37}]
[{"$f":"\"Løsarbejder\"&REPT(\".\",200)","v":"Løsarbejder........................................................................................................................................................................................................"},"Løs",null,{"$f":"B174","v":2.0099999999999998},{"$f":"B174","v":2.0099999999999998},{"$f":"(TIMER/(52*37))*25","v":1.2993762993762995E-17}]
[]
[null,null,null,"Løsarbejder :",null,"Antal feriedage",null,"Ferieberet."]
[null,null,null,"timer*E100",null,"Beregnet",null,"Timer"]
[{"$f":"\"Aktuelle lønmodtager\"&REPT(\".\",100)","v":"Aktuelle lønmodtager...................................................................................................."},{"$f":"L_NPER&\" \"&MID(D12,1,3)","v":"Måned "},{"$f":"IF(L_NPER=\"Måned\",C127,(IF(L_NPER=\"Feriepenge\",C130,(IF(L_NPER=\"Fejl\",0,(IF(L_NPER=\"Løs\",TIMER*FortegnTimer,(IF(((L_NPER=\"1\")+(L_NPER=\"2\")+(L_NPER=\"3\"))=1,(C129*VALUE(L_NPER)),\"\")))))))))","v":39},{"$f":"IF(L_NPER=\"Måned\",D127,(IF(L_NPER=\"Løs\",(E130*TIMER*FortegnTimer),(IF(L_NPER=\"Feriepenge\",0,(IF(((L_NPER=\"1\")+(L_NPER=\"2\")+(L_NPER=\"3\"))=1,(D129*VALUE(L_NPER)),IF(L_NPER=\"B-Indkomst\",0,\"Fejl\"))))))))","v":284},null,{"$f":"IF(L_NPER=\"Måned\",F127,(IF(L_NPER=\"Løs\",(F130),(IF(L_NPER=\"Feriepenge\",0,(IF(((L_NPER=\"1\")+(L_NPER=\"2\")+(L_NPER=\"3\"))=1,(F129*VALUE(L_NPER)),(IF(L_NPER=\"B-Indkomst\",0,\"Fejl\")))))))))","v":2.08},null,{"$f":"ABS(H13)","v":1.0000000000000001E-15}]
[]
[]
["Lønmodtager :"]
[null,"Måned","14 DG","Uge","Dag"]
[{"$f":"\"Skattekort lønmodtager fradrag\"&REPT(\".\",100)","v":"Skattekort lønmodtager fradrag...................................................................................................."},{"$f":"IF(F7<>\"SøgeNavn\",VALUE(LOOKUP(A7,Lønmodtager!A4:A100,Lønmodtager!J4:J100)),\"\")","v":0},{"$f":"TRUNC(B139/4.33333333*2)","v":0},{"$f":"TRUNC(C139/2)","v":0},{"$f":"TRUNC(D139/7)","v":0}]
[]
[{"$f":"\"Beregnet feriepenge fradrag\"&REPT(\".\",100)","v":"Beregnet feriepenge fradrag...................................................................................................."},{"$f":"TRUNC(B148*DAGFRD)","v":0},{"$f":"TRUNC(C148*DAGFRD)","v":0},{"$f":"TRUNC(D148*DAGFRD)","v":0},{"$f":"TRUNC(E148*DAGFRD)","v":0}]
[]
[{"$f":"\"Skattekort lønmodtager træk-%\"&REPT(\".\",100)","v":"Skattekort lønmodtager træk-%...................................................................................................."},{"$f":"VALUE(LOOKUP(A7,Lønmodtager!A4:A100,Lønmodtager!I4:I100))/100","v":0.46}]
[{"$f":"IF(B144=1,\"Beregn Søgnehelligdagsbetaling\"&REPT(\".\",200),\"\")","v":""},{"$f":"LOOKUP(A7,Lønmodtager!A4:A100,Lønmodtager!T4:T100)","v":0}]
[]
["Årsbestemte satser : "]
[null,"Måned","14 DG","Uge","Dag"]
[{"$f":"\"Feriep. fradrag sats * Dagsfrd\"&REPT(\".\",100)","v":"Feriep. fradrag sats * Dagsfrd...................................................................................................."},3.25,1.5,0.75,{"$f":"D148/5","v":0.15}]
[{"$f":"\"AM-bidrag lønmodtager\"&REPT(\".\",100)","v":"AM-bidrag lønmodtager...................................................................................................."},0.08]
[{"$f":"\"Midlertid pensionsops. løn.modt.\"&REPT(\".\",100)","v":"Midlertid pensionsops. løn.modt....................................................................................................."},{"$f":"LOOKUP(A7,Lønmodtager!A4:A100,Lønmodtager!N4:N100)/100","v":0}," korrigeres automatisk ift. lønmodtager kolonne N"]
[{"$f":"\"Dagpengesats max. pr. dag\"&REPT(\".\",100)","v":"Dagpengesats max. pr. dag...................................................................................................."},871," Tjek den aktuelle sats : Klik på dette link ---->",null,"http://www.3f.dk/haandboeger/a_kassen/arbejdsloeshedskassen/dagpengesatser/dagpengesatser-2014"]
[{"$f":"\"Daggodtg. 1.-2.-3. ledighedsdag\"&REPT(\".\",100)","v":"Daggodtg. 1.-2.-3. ledighedsdag...................................................................................................."},871," pr. dag - kan ændre sig i løbet af året"]
[{"$f":"\"Max. gange pr. år Dagp.godtg.\"&REPT(\".\",100)","v":"Max. gange pr. år Dagp.godtg....................................................................................................."},16]
[{"$f":"\"Feriepengesats\"&REPT(\".\",200)","v":"Feriepengesats........................................................................................................................................................................................................"},0.125,"Fra 1.12.03 skal der løbende indeholdes A-skat/AM/SP af feriepenge."]
[{"$f":"\"Arbejdstimer pr. Uge\"&REPT(\".\",200)","v":"Arbejdstimer pr. Uge........................................................................................................................................................................................................"},37," ----->","Timer/dg",{"$f":"B155/5","v":7.4}]
["Pension :",null,"Ønskes pensionsberegning sæt 1 i Lønmodtager kol. S"]
[{"$f":"\"Pension %-af Ferieberet. Løn + Feriepenge\"&REPT(\".\",200)","v":"Pension %-af Ferieberet. Løn + Feriepenge........................................................................................................................................................................................................"},0.1," Summen af %'er for lønmodtager og arbejdsgiver"]
[{"$f":"\"Pension %-andel lønmodtager\"&REPT(\".\",200)","v":"Pension %-andel lønmodtager........................................................................................................................................................................................................"},0.33333333333333331," Lønmodtager % beregnet -------------->",null,{"$f":"B157*B158","v":3.3333333333333333E-2}]
[{"$f":"\"Pension %-andel arbejdsgiver\"&REPT(\".\",200)","v":"Pension %-andel arbejdsgiver........................................................................................................................................................................................................"},{"$f":"2/3","v":0.66666666666666663}," Arbejdsgiver % beregnet --------------->",null,{"$f":"B157*B159","v":6.6666666666666666E-2}]
[{"$f":"\"Skattefri befordringsgodtgørelse indtil \"&REPT(\".\",200)","v":"Skattefri befordringsgodtgørelse indtil ........................................................................................................................................................................................................"},20000]
[{"$f":"\"Skattefri befordringsgodtg. 01.01-31.12\"&REPT(\".\",100)","v":"Skattefri befordringsgodtg. 01.01-31.12...................................................................................................."},3.56]
[]
[{"$f":"\"Skattefri befordringsgodtgørelse over \"&REPT(\".\",200)","v":"Skattefri befordringsgodtgørelse over ........................................................................................................................................................................................................"},20000,null,{"$f":"IF(E70>B160,\"km > grænse\",\"\")","v":""}]
[{"$f":"\"Skattefri befordringsgodtg. 01.01-31.12. Over grænse\"&REPT(\".\",100)","v":"Skattefri befordringsgodtg. 01.01-31.12. Over grænse...................................................................................................."},1.98,null,{"$f":"IF(E70>B160,E70-B160,\"\")","v":""}]
[]
[{"$f":"\"Skal der bruges skattefradrag v/feriepenge 0/1\"&REPT(\".\",200)","v":"Skal der bruges skattefradrag v/feriepenge 0/1........................................................................................................................................................................................................"},1,"Sættes til 1 hvis lønmodtageren ikke bruger sit fradrag under ferie."]
[]
["Søgnehelligdagsbetaling",5.7500000000000002E-2," Hvis bruges sæt kolonne T til 1 på Lønmodtager-fanebladet"]
[]
["ATP-satser: Indtastes som Samlet bidrag lønmodtager+arbejdsgiver",null," Tjek den aktuelle sats : Klik på dette link ---->",null,"https://indberet.virk.dk/sites/default/files/atp-satser_offentlige.pdf"]
["Månedslønnede mindst 117 timer (fuldtid)",284]
["14-dages lønnede mindst 54 timer (fuldtid)",149.4]
["Ugelønnede mindst 27 timer (fuldtid)",74.7]
["Løsarbejdere pr. time",2.0099999999999998]

{"sheet":"AskatAMSP","index":4,"n_rows":19,"n_cols":8,"rows_kept":19,"cut":false,"hidden":false,"merged":[]}
[{"$f":"Lønseddel!D2","v":"SE-NR.........................."},null,{"$f":"Lønseddel!E2","v":"12 34 56 78"},null,null,null,null,{"$f":"Lønseddel!B122","v":"2019"}]
[null,null,null,null,null,null,null,{"$f":"Lønseddel!D10","v":"Januar"}]
[{"$f":"Lønseddel!D3","v":"TestVirk.navn"}]
[{"$f":"Lønseddel!D4","v":"v/Test.Indehaver"}]
[{"$f":"Lønseddel!D5","v":"Test.Adr.Virk"}]
[{"$f":"Lønseddel!D6","v":"1234 Testby"}]
[]
[{"$f":"IF(SUM(Lønseddel!C77:'Lønseddel'!C79)<>0,\"Afregningen indeholder den ikke År-Til-Dato opdaterede lønseddel\",\"\")","v":""}]
[]
["Månedlig Afregning A-skat/AM"]
[]
[{"$f":"Lønseddel!A77","v":""},null,null,null,null,{"$f":"Lønseddel!E77","v":0}]
[{"$f":"Lønseddel!A79","v":""},null,null,null,null,{"$f":"Lønseddel!E79","v":0}]
[{"$f":"Lønseddel!A81","v":""},null,null,null,null,"--------",">",{"$f":"SUM(F12:F13)","v":0}]
[]
[{"$f":"Lønseddel!A78","v":""},null,null,null,null,null,null,{"$f":"Lønseddel!E78","v":0}]
[null,null,null,null,null,null,null,"----------"]
[{"$f":"\"AM + A-skat\"&REPT(\".\",200)","v":"AM + A-skat........................................................................................................................................................................................................"},null,null,null,null,null,null,{"$f":"SUM(H14:H17)","v":0}]
[null,null,null,null,null,null,null,"----------"]

{"sheet":"ATP-Feriepenge-SH","index":5,"n_rows":68,"n_cols":11,"rows_kept":68,"cut":false,"hidden":false,"merged":[]}
[]
[]
[{"$f":"Lønseddel!D2","v":"SE-NR.........................."},{"$f":"Lønseddel!E2","v":"12 34 56 78"},null,null,null,null,{"$f":"AskatAMSP!A10","v":"Månedlig Afregning A-skat/AM"},null,null,null,{"$f":"Lønseddel!E10","v":"2019"}]
[{"$f":"Lønseddel!D3","v":"TestVirk.navn"},null,null,null,null,null,"Indberetning elektronisk :","http://www.toldskat.dk/basic.php?source=/tastselverhverv/tastselverhverv.cnt",null,null,{"$f":"Lønseddel!D10","v":"Januar"}]
[{"$f":"Lønseddel!D4","v":"v/Test.Indehaver"},null,null,null,null,null,{"$f":"AskatAMSP!A12","v":""},null,null,{"$f":"AskatAMSP!F12","v":0}]
[{"$f":"Lønseddel!D5","v":"Test.Adr.Virk"},null,null,null,null,null,{"$f":"AskatAMSP!A13","v":""},null,null,{"$f":"AskatAMSP!F13","v":0}]
[{"$f":"Lønseddel!D6","v":"1234 Testby"},null,null,null,null,null,{"$f":"AskatAMSP!A14","v":""},null,null,"------>",{"$f":"SUM(J5:J6)","v":0}]
[]
[null,null,null,null,null,null,{"$f":"AskatAMSP!A16","v":""},null,null,null,{"$f":"AskatAMSP!H16","v":0}]
[{"$f":"IF(Lønseddel!C84<>0,\"ATP indeholder den ikke År-Til-Dato opdaterede lønseddel\",\"\")","v":""},null,null,null,null,null,null,null,null,null,"---------"]
[{"$f":"Lønseddel!A84","v":""},null,null,null,{"$f":"Lønseddel!E84","v":0},null,{"$f":"AskatAMSP!A18","v":"AM + A-skat........................................................................................................................................................................................................"},null,null,null,{"$f":"SUM(K7:K10)","v":0}]
[null,null,null,null,null,null,null,null,null,null,"---------"]
[]
["KvartalsAfregning ATP & Feriepenge & Skyldig SH.",null,null,null,null,null,{"$f":"IF((Lønseddel!C85+Lønseddel!C88)<>0,\"Feriepenge/SH indeholder IKKE \",\"\")","v":""}]
["Indberetning elektronisk :","http://www.arbejdsgiver.net/",null,null,null,null,{"$f":"IF((Lønseddel!C85+Lønseddel!C88)<>0,\"tal fra den ikke År-Til-Dato opdaterede lønseddel\",\"\")","v":""}]
[null,null,"Ferie","Ferie","Skyldig",null,null,null,{"$f":"IF(G68<>\"\",\"Ferie\",\"\")","v":""},{"$f":"IF(G68<>\"\",\"Ferie\",\"\")","v":""},{"$f":"IF(G68<>\"\",\"Skyldig\",\"\")","v":""}]
["Feriepengeafregning","Cpr-nr.","Dage","Penge","SH-Saldo",null,{"$f":"IF(G68<>\"\",\"Feriepengeafregning\",\"\")","v":""},{"$f":"IF(G68<>\"\",\"Cpr-nr.\",\"\")","v":""},{"$f":"IF(G68<>\"\",\"Dage\",\"\")","v":""},{"$f":"IF(G68<>\"\",\"Penge\",\"\")","v":""},{"$f":"IF(G68<>\"\",\"SH-Saldo\",\"\")","v":""}]
[{"$f":"IF(Lønmodtager!A5=\"ÅÅÅ\",\"\",Lønmodtager!A5&REPT(\".\",200))","v":"Søgenavn indtastes i celle F7........................................................................................................................................................................................................"},{"$f":"IF(Lønmodtager!A5=\"ÅÅÅ\",\"\",Lønmodtager!H5)","v":"000000-0000"},{"$f":"Lønmodtager!M5","v":0},{"$f":"Lønmodtager!L5","v":0},{"$f":"Lønmodtager!U5-Lønmodtager!V5","v":0},null,{"$f":"IF(Lønmodtager!A54=\"ÅÅÅ\",\"\",Lønmodtager!A54&REPT(\".\",200))","v":""},{"$f":"IF(Lønmodtager!A54=\"ÅÅÅ\",\"\",Lønmodtager!H54)","v":""},{"$f":"Lønmodtager!M54","v":0},{"$f":"Lønmodtager!L54","v":0},{"$f":"Lønmodtager!U54-Lønmodtager!V54","v":0}]
[{"$f":"IF(Lønmodtager!A6=\"ÅÅÅ\",\"\",Lønmodtager!A6&REPT(\".\",200))","v":"Testperson........................................................................................................................................................................................................"},{"$f":"IF(Lønmodtager!A6=\"ÅÅÅ\",\"\",Lønmodtager!H6)","v":"12345678-1234"},{"$f":"Lønmodtager!M6","v":0},{"$f":"Lønmodtager!L6","v":0},{"$f":"Lønmodtager!U6-Lønmodtager!V6","v":0},null,{"$f":"IF(Lønmodtager!A55=\"ÅÅÅ\",\"\",Lønmodtager!A55&REPT(\".\",200))","v":""},{"$f":"IF(Lønmodtager!A55=\"ÅÅÅ\",\"\",Lønmodtager!H55)","v":""},{"$f":"Lønmodtager!M55","v":0},{"$f":"Lønmodtager!L55","v":0},{"$f":"Lønmodtager!U55-Lønmodtager!V55","v":0}]
[{"$f":"IF(Lønmodtager!A7=\"ÅÅÅ\",\"\",Lønmodtager!A7&REPT(\".\",200))","v":""},{"$f":"IF(Lønmodtager!A7=\"ÅÅÅ\",\"\",Lønmodtager!H7)","v":""},{"$f":"Lønmodtager!M7","v":0},{"$f":"Lønmodtager!L7","v":0},{"$f":"Lønmodtager!U7-Lønmodtager!V7","v":0},null,{"$f":"IF(Lønmodtager!A56=\"ÅÅÅ\",\"\",Lønmodtager!A56&REPT(\".\",200))","v":""},{"$f":"IF(Lønmodtager!A56=\"ÅÅÅ\",\"\",Lønmodtager!H56)","v":""},{"$f":"Lønmodtager!M56","v":0},{"$f":"Lønmodtager!L56","v":0},{"$f":"Lønmodtager!U56-Lønmodtager!V56","v":0}]
[{"$f":"IF(Lønmodtager!A8=\"ÅÅÅ\",\"\",Lønmodtager!A8&REPT(\".\",200))","v":""},{"$f":"IF(Lønmodtager!A8=\"ÅÅÅ\",\"\",Lønmodtager!H8)","v":""},{"$f":"Lønmodtager!M8","v":0},{"$f":"Lønmodtager!L8","v":0},{"$f":"Lønmodtager!U8-Lønmodtager!V8","v":0},null,{"$f":"IF(Lønmodtager!A57=\"ÅÅÅ\",\"\",Lønmodtager!A57&REPT(\".\",200))","v":""},{"$f":"IF(Lønmodtager!A57=\"ÅÅÅ\",\"\",Lønmodtager!H57)","v":""},{"$f":"Lønmodtager!M57","v":0},{"$f":"Lønmodtager!L57","v":0},{"$f":"Lønmodtager!U57-Lønmodtager!V57","v":0}]
[{"$f":"IF(Lønmodtager!A9=\"ÅÅÅ\",\"\",Lønmodtager!A9&REPT(\".\",200))","v":""},{"$f":"IF(Lønmodtager!A9=\"ÅÅÅ\",\"\",Lønmodtager!H9)","v":""},{"$f":"Lønmodtager!M9","v":0},{"$f":"Lønmodtager!L9","v":0},{"$f":"Lønmodtager!U9-Lønmodtager!V9","v":0},null,{"$f":"IF(Lønmodtager!A58=\"ÅÅÅ\",\"\",Lønmodtager!A58&REPT(\".\",200))","v":""},{"$f":"IF(Lønmodtager!A58=\"ÅÅÅ\",\"\",Lønmodtager!H58)","v":""},{"$f":"Lønmodtager!M58","v":0},{"$f":"Lønmodtager!L58","v":0},{"$f":"Lønmodtager!U58-Lønmodtager!V58","v":0}]
[{"$f":"IF(Lønmodtager!A10=\"ÅÅÅ\",\"\",Lønmodtager!A10&REPT(\".\",200))","v":""},{"$f":"IF(Lønmodtager!A10=\"ÅÅÅ\",\"\",Lønmodtager!H10)","v":""},{"$f":"Lønmodtager!M10","v":0},{"$f":"Lønmodtager!L10","v":0},{"$f":"Lønmodtager!U10-Lønmodtager!V10","v":0},null,{"$f":"IF(Lønmodtager!A59=\"ÅÅÅ\",\"\",Lønmodtager!A59&REPT(\".\",200))","v":""},{"$f":"IF(Lønmodtager!A59=\"ÅÅÅ\",\"\",Lønmodtager!H59)","v":""},{"$f":"Lønmodtager!M59","v":0},{"$f":"Lønmodtager!L59","v":0},{"$f":"Lønmodtager!U59-Lønmodtager!V59","v":0}]
[{"$f":"IF(Lønmodtager!A11=\"ÅÅÅ\",\"\",Lønmodtager!A11&REPT(\".\",200))","v":""},{"$f":"IF(Lønmodtager!A11=\"ÅÅÅ\",\"\",Lønmodtager!H11)","v":""},{"$f":"Lønmodtager!M11","v":0},{"$f":"Lønmodtager!L11","v":0},{"$f":"Lønmodtager!U11-Lønmodtager!V11","v":0},null,{"$f":"IF(Lønmodtager!A60=\"ÅÅÅ\",\"\",Lønmodtager!A60&REPT(\".\",200))","v":""},{"$f":"IF(Lønmodtager!A60=\"ÅÅÅ\",\"\",Lønmodtager!H60)","v":""},{"$f":"Lønmodtager!M60","v":0},{"$f":"Lønmodtager!L60","v":0},{"$f":"Lønmodtager!U60-Lønmodtager!V60","v":0}]
[{"$f":"IF(Lønmodtager!A12=\"ÅÅÅ\",\"\",Lønmodtager!A12&REPT(\".\",200))","v":""},{"$f":"IF(Lønmodtager!A12=\"ÅÅÅ\",\"\",Lønmodtager!H12)","v":""},{"$f":"Lønmodtager!M12","v":0},{"$f":"Lønmodtager!L12","v":0},{"$f":"Lønmodtager!U12-Lønmodtager!V12","v":0},null,{"$f":"IF(Lønmodtager!A61=\"ÅÅÅ\",\"\",Lønmodtager!A61&REPT(\".\",200))","v":""},{"$f":"IF(Lønmodtager!A61=\"ÅÅÅ\",\"\",Lønmodtager!H61)","v":""},{"$f":"Lønmodtager!M61","v":0},{"$f":"Lønmodtager!L61","v":0},{"$f":"Lønmodtager!U61-Lønmodtager!V61","v":0}]
[{"$f":"IF(Lønmodtager!A13=\"ÅÅÅ\",\"\",Lønmodtager!A13&REPT(\".\",200))","v":""},{"$f":"IF(Lønmodtager!A13=\"ÅÅÅ\",\"\",Lønmodtager!H13)","v":""},{"$f":"Lønmodtager!M13","v":0},{"$f":"Lønmodtager!L13","v":0},{"$f":"Lønmodtager!U13-Lønmodtager!V13","v":0},null,{"$f":"IF(Lønmodtager!A62=\"ÅÅÅ\",\"\",Lønmodtager!A62&REPT(\".\",200))","v":""},{"$f":"IF(Lønmodtager!A62=\"ÅÅÅ\",\"\",Lønmodtager!H62)","v":""},{"$f":"Lønmodtager!M62","v":0},{"$f":"Lønmodtager!L62","v":0},{"$f":"Lønmodtager!U62-Lønmodtager!V62","v":0}]
[{"$f":"IF(Lønmodtager!A14=\"ÅÅÅ\",\"\",Lønmodtager!A14&REPT(\".\",200))","v":""},{"$f":"IF(Lønmodtager!A14=\"ÅÅÅ\",\"\",Lønmodtager!H14)","v":""},{"$f":"Lønmodtager!M14","v":0},{"$f":"Lønmodtager!L14","v":0},{"$f":"Lønmodtager!U14-Lønmodtager!V14","v":0},null,{"$f":"IF(Lønmodtager!A63=\"ÅÅÅ\",\"\",Lønmodtager!A63&REPT(\".\",200))","v":""},{"$f":"IF(Lønmodtager!A63=\"ÅÅÅ\",\"\",Lønmodtager!H63)","v":""},{"$f":"Lønmodtager!M63","v":0},{"$f":"Lønmodtager!L63","v":0},{"$f":"Lønmodtager!U63-Lønmodtager!V63","v":0}]
[{"$f":"IF(Lønmodtager!A15=\"ÅÅÅ\",\"\",Lønmodtager!A15&REPT(\".\",200))","v":""},{"$f":"IF(Lønmodtager!A15=\"ÅÅÅ\",\"\",Lønmodtager!H15)","v":""},{"$f":"Lønmodtager!M15","v":0},{"$f":"Lønmodtager!L15","v":0},{"$f":"Lønmodtager!U15-Lønmodtager!V15","v":0},null,{"$f":"IF(Lønmodtager!A64=\"ÅÅÅ\",\"\",Lønmodtager!A64&REPT(\".\",200))","v":""},{"$f":"IF(Lønmodtager!A64=\"ÅÅÅ\",\"\",Lønmodtager!H64)","v":""},{"$f":"Lønmodtager!M64","v":0},{"$f":"Lønmodtager!L64","v":0},{"$f":"Lønmodtager!U64-Lønmodtager!V64","v":0}]
[{"$f":"IF(Lønmodtager!A16=\"ÅÅÅ\",\"\",Lønmodtager!A16&REPT(\".\",200))","v":""},{"$f":"IF(Lønmodtager!A16=\"ÅÅÅ\",\"\",Lønmodtager!H16)","v":""},{"$f":"Lønmodtager!M16","v":0},{"$f":"Lønmodtager!L16","v":0},{"$f":"Lønmodtager!U16-Lønmodtager!V16","v":0},null,{"$f":"IF(Lønmodtager!A65=\"ÅÅÅ\",\"\",Lønmodtager!A65&REPT(\".\",200))","v":""},{"$f":"IF(Lønmodtager!A65=\"ÅÅÅ\",\"\",Lønmodtager!H65)","v":""},{"$f":"Lønmodtager!M65","v":0},{"$f":"Lønmodtager!L65","v":0},{"$f":"Lønmodtager!U65-Lønmodtager!V65","v":0}]
[{"$f":"IF(Lønmodtager!A17=\"ÅÅÅ\",\"\",Lønmodtager!A17&REPT(\".\",200))","v":""},{"$f":"IF(Lønmodtager!A17=\"ÅÅÅ\",\"\",Lønmodtager!H17)","v":""},{"$f":"Lønmodtager!M17","v":0},{"$f":"Lønmodtager!L17","v":0},{"$f":"Lønmodtager!U17-Lønmodtager!V17","v":0},null,{"$f":"IF(Lønmodtager!A66=\"ÅÅÅ\",\"\",Lønmodtager!A66&REPT(\".\",200))","v":""},{"$f":"IF(Lønmodtager!A66=\"ÅÅÅ\",\"\",Lønmodtager!H66)","v":""},{"$f":"Lønmodtager!M66","v":0},{"$f":"Lønmodtager!L66","v":0},{"$f":"Lønmodtager!U66-Lønmodtager!V66","v":0}]
[{"$f":"IF(Lønmodtager!A18=\"ÅÅÅ\",\"\",Lønmodtager!A18&REPT(\".\",200))","v":""},{"$f":"IF(Lønmodtager!A18=\"ÅÅÅ\",\"\",Lønmodtager!H18)","v":""},{"$f":"Lønmodtager!M18","v":0},{"$f":"Lønmodtager!L18","v":0},{"$f":"Lønmodtager!U18-Lønmodtager!V18","v":0},null,{"$f":"IF(Lønmodtager!A67=\"ÅÅÅ\",\"\",Lønmodtager!A67&REPT(\".\",200))","v":""},{"$f":"IF(Lønmodtager!A67=\"ÅÅÅ\",\"\",Lønmodtager!H67)","v":""},{"$f":"Lønmodtager!M67","v":0},{"$f":"Lønmodtager!L67","v":0},{"$f":"Lønmodtager!U67-Lønmodtager!V67","v":0}]
[{"$f":"IF(Lønmodtager!A19=\"ÅÅÅ\",\"\",Lønmodtager!A19&REPT(\".\",200))","v":""},{"$f":"IF(Lønmodtager!A19=\"ÅÅÅ\",\"\",Lønmodtager!H19)","v":""},{"$f":"Lønmodtager!M19","v":0},{"$f":"Lønmodtager!L19","v":0},{"$f":"Lønmodtager!U19-Lønmodtager!V19","v":0},null,{"$f":"IF(Lønmodtager!A68=\"ÅÅÅ\",\"\",Lønmodtager!A68&REPT(\".\",200))","v":""},{"$f":"IF(Lønmodtager!A68=\"ÅÅÅ\",\"\",Lønmodtager!H68)","v":""},{"$f":"Lønmodtager!M68","v":0},{"$f":"Lønmodtager!L68","v":0},{"$f":"Lønmodtager!U68-Lønmodtager!V68","v":0}]
[{"$f":"IF(Lønmodtager!A20=\"ÅÅÅ\",\"\",Lønmodtager!A20&REPT(\".\",200))","v":""},{"$f":"IF(Lønmodtager!A20=\"ÅÅÅ\",\"\",Lønmodtager!H20)","v":""},{"$f":"Lønmodtager!M20","v":0},{"$f":"Lønmodtager!L20","v":0},{"$f":"Lønmodtager!U20-Lønmodtager!V20","v":0},null,{"$f":"IF(Lønmodtager!A69=\"ÅÅÅ\",\"\",Lønmodtager!A69&REPT(\".\",200))","v":""},{"$f":"IF(Lønmodtager!A69=\"ÅÅÅ\",\"\",Lønmodtager!H69)","v":""},{"$f":"Lønmodtager!M69","v":0},{"$f":"Lønmodtager!L69","v":0},{"$f":"Lønmodtager!U69-Lønmodtager!V69","v":0}]
[{"$f":"IF(Lønmodtager!A21=\"ÅÅÅ\",\"\",Lønmodtager!A21&REPT(\".\",200))","v":""},{"$f":"IF(Lønmodtager!A21=\"ÅÅÅ\",\"\",Lønmodtager!H21)","v":""},{"$f":"Lønmodtager!M21","v":0},{"$f":"Lønmodtager!L21","v":0},{"$f":"Lønmodtager!U21-Lønmodtager!V21","v":0},null,{"$f":"IF(Lønmodtager!A70=\"ÅÅÅ\",\"\",Lønmodtager!A70&REPT(\".\",200))","v":""},{"$f":"IF(Lønmodtager!A70=\"ÅÅÅ\",\"\",Lønmodtager!H70)","v":""},{"$f":"Lønmodtager!M70","v":0},{"$f":"Lønmodtager!L70","v":0},{"$f":"Lønmodtager!U70-Lønmodtager!V70","v":0}]
[{"$f":"IF(Lønmodtager!A22=\"ÅÅÅ\",\"\",Lønmodtager!A22&REPT(\".\",200))","v":""},{"$f":"IF(Lønmodtager!A22=\"ÅÅÅ\",\"\",Lønmodtager!H22)","v":""},{"$f":"Lønmodtager!M22","v":0},{"$f":"Lønmodtager!L22","v":0},{"$f":"Lønmodtager!U22-Lønmodtager!V22","v":0},null,{"$f":"IF(Lønmodtager!A71=\"ÅÅÅ\",\"\",Lønmodtager!A71&REPT(\".\",200))","v":""},{"$f":"IF(Lønmodtager!A71=\"ÅÅÅ\",\"\",Lønmodtager!H71)","v":""},{"$f":"Lønmodtager!M71","v":0},{"$f":"Lønmodtager!L71","v":0},{"$f":"Lønmodtager!U71-Lønmodtager!V71","v":0}]
[{"$f":"IF(Lønmodtager!A23=\"ÅÅÅ\",\"\",Lønmodtager!A23&REPT(\".\",200))","v":""},{"$f":"IF(Lønmodtager!A23=\"ÅÅÅ\",\"\",Lønmodtager!H23)","v":""},{"$f":"Lønmodtager!M23","v":0},{"$f":"Lønmodtager!L23","v":0},{"$f":"Lønmodtager!U23-Lønmodtager!V23","v":0},null,{"$f":"IF(Lønmodtager!A72=\"ÅÅÅ\",\"\",Lønmodtager!A72&REPT(\".\",200))","v":""},{"$f":"IF(Lønmodtager!A72=\"ÅÅÅ\",\"\",Lønmodtager!H72)","v":""},{"$f":"Lønmodtager!M72","v":0},{"$f":"Lønmodtager!L72","v":0},{"$f":"Lønmodtager!U72-Lønmodtager!V72","v":0}]
[{"$f":"IF(Lønmodtager!A24=\"ÅÅÅ\",\"\",Lønmodtager!A24&REPT(\".\",200))","v":""},{"$f":"IF(Lønmodtager!A24=\"ÅÅÅ\",\"\",Lønmodtager!H24)","v":""},{"$f":"Lønmodtager!M24","v":0},{"$f":"Lønmodtager!L24","v":0},{"$f":"Lønmodtager!U24-Lønmodtager!V24","v":0},null,{"$f":"IF(Lønmodtager!A73=\"ÅÅÅ\",\"\",Lønmodtager!A73&REPT(\".\",200))","v":""},{"$f":"IF(Lønmodtager!A73=\"ÅÅÅ\",\"\",Lønmodtager!H73)","v":""},{"$f":"Lønmodtager!M73","v":0},{"$f":"Lønmodtager!L73","v":0},{"$f":"Lønmodtager!U73-Lønmodtager!V73","v":0}]
[{"$f":"IF(Lønmodtager!A25=\"ÅÅÅ\",\"\",Lønmodtager!A25&REPT(\".\",200))","v":""},{"$f":"IF(Lønmodtager!A25=\"ÅÅÅ\",\"\",Lønmodtager!H25)","v":""},{"$f":"Lønmodtager!M25","v":0},{"$f":"Lønmodtager!L25","v":0},{"$f":"Lønmodtager!U25-Lønmodtager!V25","v":0},null,{"$f":"IF(Lønmodtager!A74=\"ÅÅÅ\",\"\",Lønmodtager!A74&REPT(\".\",200))","v":""},{"$f":"IF(Lønmodtager!A74=\"ÅÅÅ\",\"\",Lønmodtager!H74)","v":""},{"$f":"Lønmodtager!M74","v":0},{"$f":"Lønmodtager!L74","v":0},{"$f":"Lønmodtager!U74-Lønmodtager!V74","v":0}]
[{"$f":"IF(Lønmodtager!A26=\"ÅÅÅ\",\"\",Lønmodtager!A26&REPT(\".\",200))","v":""},{"$f":"IF(Lønmodtager!A26=\"ÅÅÅ\",\"\",Lønmodtager!H26)","v":""},{"$f":"Lønmodtager!M26","v":0},{"$f":"Lønmodtager!L26","v":0},{"$f":"Lønmodtager!U26-Lønmodtager!V26","v":0},null,{"$f":"IF(Lønmodtager!A75=\"ÅÅÅ\",\"\",Lønmodtager!A75&REPT(\".\",200))","v":""},{"$f":"IF(Lønmodtager!A75=\"ÅÅÅ\",\"\",Lønmodtager!H75)","v":""},{"$f":"Lønmodtager!M75","v":0},{"$f":"Lønmodtager!L75","v":0},{"$f":"Lønmodtager!U75-Lønmodtager!V75","v":0}]
[{"$f":"IF(Lønmodtager!A27=\"ÅÅÅ\",\"\",Lønmodtager!A27&REPT(\".\",200))","v":""},{"$f":"IF(Lønmodtager!A27=\"ÅÅÅ\",\"\",Lønmodtager!H27)","v":""},{"$f":"Lønmodtager!M27","v":0},{"$f":"Lønmodtager!L27","v":0},{"$f":"Lønmodtager!U27-Lønmodtager!V27","v":0},null,{"$f":"IF(Lønmodtager!A76=\"ÅÅÅ\",\"\",Lønmodtager!A76&REPT(\".\",200))","v":""},{"$f":"IF(Lønmodtager!A76=\"ÅÅÅ\",\"\",Lønmodtager!H76)","v":""},{"$f":"Lønmodtager!M76","v":0},{"$f":"Lønmodtager!L76","v":0},{"$f":"Lønmodtager!U76-Lønmodtager!V76","v":0}]
[{"$f":"IF(Lønmodtager!A28=\"ÅÅÅ\",\"\",Lønmodtager!A28&REPT(\".\",200))","v":""},{"$f":"IF(Lønmodtager!A28=\"ÅÅÅ\",\"\",Lønmodtager!H28)","v":""},{"$f":"Lønmodtager!M28","v":0},{"$f":"Lønmodtager!L28","v":0},{"$f":"Lønmodtager!U28-Lønmodtager!V28","v":0},null,{"$f":"IF(Lønmodtager!A77=\"ÅÅÅ\",\"\",Lønmodtager!A77&REPT(\".\",200))","v":""},{"$f":"IF(Lønmodtager!A77=\"ÅÅÅ\",\"\",Lønmodtager!H77)","v":""},{"$f":"Lønmodtager!M77","v":0},{"$f":"Lønmodtager!L77","v":0},{"$f":"Lønmodtager!U77-Lønmodtager!V77","v":0}]
[{"$f":"IF(Lønmodtager!A29=\"ÅÅÅ\",\"\",Lønmodtager!A29&REPT(\".\",200))","v":""},{"$f":"IF(Lønmodtager!A29=\"ÅÅÅ\",\"\",Lønmodtager!H29)","v":""},{"$f":"Lønmodtager!M29","v":0},{"$f":"Lønmodtager!L29","v":0},{"$f":"Lønmodtager!U29-Lønmodtager!V29","v":0},null,{"$f":"IF(Lønmodtager!A78=\"ÅÅÅ\",\"\",Lønmodtager!A78&REPT(\".\",200))","v":""},{"$f":"IF(Lønmodtager!A78=\"ÅÅÅ\",\"\",Lønmodtager!H78)","v":""},{"$f":"Lønmodtager!M78","v":0},{"$f":"Lønmodtager!L78","v":0},{"$f":"Lønmodtager!U78-Lønmodtager!V78","v":0}]
[{"$f":"IF(Lønmodtager!A30=\"ÅÅÅ\",\"\",Lønmodtager!A30&REPT(\".\",200))","v":""},{"$f":"IF(Lønmodtager!A30=\"ÅÅÅ\",\"\",Lønmodtager!H30)","v":""},{"$f":"Lønmodtager!M30","v":0},{"$f":"Lønmodtager!L30","v":0},{"$f":"Lønmodtager!U30-Lønmodtager!V30","v":0},null,{"$f":"IF(Lønmodtager!A79=\"ÅÅÅ\",\"\",Lønmodtager!A79&REPT(\".\",200))","v":""},{"$f":"IF(Lønmodtager!A79=\"ÅÅÅ\",\"\",Lønmodtager!H79)","v":""},{"$f":"Lønmodtager!M79","v":0},{"$f":"Lønmodtager!L79","v":0},{"$f":"Lønmodtager!U79-Lønmodtager!V79","v":0}]
[{"$f":"IF(Lønmodtager!A31=\"ÅÅÅ\",\"\",Lønmodtager!A31&REPT(\".\",200))","v":""},{"$f":"IF(Lønmodtager!A31=\"ÅÅÅ\",\"\",Lønmodtager!H31)","v":""},{"$f":"Lønmodtager!M31","v":0},{"$f":"Lønmodtager!L31","v":0},{"$f":"Lønmodtager!U31-Lønmodtager!V31","v":0},null,{"$f":"IF(Lønmodtager!A80=\"ÅÅÅ\",\"\",Lønmodtager!A80&REPT(\".\",200))","v":""},{"$f":"IF(Lønmodtager!A80=\"ÅÅÅ\",\"\",Lønmodtager!H80)","v":""},{"$f":"Lønmodtager!M80","v":0},{"$f":"Lønmodtager!L80","v":0},{"$f":"Lønmodtager!U80-Lønmodtager!V80","v":0}]
[{"$f":"IF(Lønmodtager!A32=\"ÅÅÅ\",\"\",Lønmodtager!A32&REPT(\".\",200))","v":""},{"$f":"IF(Lønmodtager!A32=\"ÅÅÅ\",\"\",Lønmodtager!H32)","v":""},{"$f":"Lønmodtager!M32","v":0},{"$f":"Lønmodtager!L32","v":0},{"$f":"Lønmodtager!U32-Lønmodtager!V32","v":0},null,{"$f":"IF(Lønmodtager!A81=\"ÅÅÅ\",\"\",Lønmodtager!A81&REPT(\".\",200))","v":""},{"$f":"IF(Lønmodtager!A81=\"ÅÅÅ\",\"\",Lønmodtager!H81)","v":""},{"$f":"Lønmodtager!M81","v":0},{"$f":"Lønmodtager!L81","v":0},{"$f":"Lønmodtager!U81-Lønmodtager!V81","v":0}]
[{"$f":"IF(Lønmodtager!A33=\"ÅÅÅ\",\"\",Lønmodtager!A33&REPT(\".\",200))","v":""},{"$f":"IF(Lønmodtager!A33=\"ÅÅÅ\",\"\",Lønmodtager!H33)","v":""},{"$f":"Lønmodtager!M33","v":0},{"$f":"Lønmodtager!L33","v":0},{"$f":"Lønmodtager!U33-Lønmodtager!V33","v":0},null,{"$f":"IF(Lønmodtager!A82=\"ÅÅÅ\",\"\",Lønmodtager!A82&REPT(\".\",200))","v":""},{"$f":"IF(Lønmodtager!A82=\"ÅÅÅ\",\"\",Lønmodtager!H82)","v":""},{"$f":"Lønmodtager!M82","v":0},{"$f":"Lønmodtager!L82","v":0},{"$f":"Lønmodtager!U82-Lønmodtager!V82","v":0}]
[{"$f":"IF(Lønmodtager!A34=\"ÅÅÅ\",\"\",Lønmodtager!A34&REPT(\".\",200))","v":""},{"$f":"IF(Lønmodtager!A34=\"ÅÅÅ\",\"\",Lønmodtager!H34)","v":""},{"$f":"Lønmodtager!M34","v":0},{"$f":"Lønmodtager!L34","v":0},{"$f":"Lønmodtager!U34-Lønmodtager!V34","v":0},null,{"$f":"IF(Lønmodtager!A83=\"ÅÅÅ\",\"\",Lønmodtager!A83&REPT(\".\",200))","v":""},{"$f":"IF(Lønmodtager!A83=\"ÅÅÅ\",\"\",Lønmodtager!H83)","v":""},{"$f":"Lønmodtager!M83","v":0},{"$f":"Lønmodtager!L83","v":0},{"$f":"Lønmodtager!U83-Lønmodtager!V83","v":0}]
[{"$f":"IF(Lønmodtager!A35=\"ÅÅÅ\",\"\",Lønmodtager!A35&REPT(\".\",200))","v":""},{"$f":"IF(Lønmodtager!A35=\"ÅÅÅ\",\"\",Lønmodtager!H35)","v":""},{"$f":"Lønmodtager!M35","v":0},{"$f":"Lønmodtager!L35","v":0},{"$f":"Lønmodtager!U35-Lønmodtager!V35","v":0},null,{"$f":"IF(Lønmodtager!A84=\"ÅÅÅ\",\"\",Lønmodtager!A84&REPT(\".\",200))","v":""},{"$f":"IF(Lønmodtager!A84=\"ÅÅÅ\",\"\",Lønmodtager!H84)","v":""},{"$f":"Lønmodtager!M84","v":0},{"$f":"Lønmodtager!L84","v":0},{"$f":"Lønmodtager!U84-Lønmodtager!V84","v":0}]
[{"$f":"IF(Lønmodtager!A36=\"ÅÅÅ\",\"\",Lønmodtager!A36&REPT(\".\",200))","v":""},{"$f":"IF(Lønmodtager!A36=\"ÅÅÅ\",\"\",Lønmodtager!H36)","v":""},{"$f":"Lønmodtager!M36","v":0},{"$f":"Lønmodtager!L36","v":0},{"$f":"Lønmodtager!U36-Lønmodtager!V36","v":0},null,{"$f":"IF(Lønmodtager!A85=\"ÅÅÅ\",\"\",Lønmodtager!A85&REPT(\".\",200))","v":""},{"$f":"IF(Lønmodtager!A85=\"ÅÅÅ\",\"\",Lønmodtager!H85)","v":""},{"$f":"Lønmodtager!M85","v":0},{"$f":"Lønmodtager!L85","v":0},{"$f":"Lønmodtager!U85-Lønmodtager!V85","v":0}]
[{"$f":"IF(Lønmodtager!A37=\"ÅÅÅ\",\"\",Lønmodtager!A37&REPT(\".\",200))","v":""},{"$f":"IF(Lønmodtager!A37=\"ÅÅÅ\",\"\",Lønmodtager!H37)","v":""},{"$f":"Lønmodtager!M37","v":0},{"$f":"Lønmodtager!L37","v":0},{"$f":"Lønmodtager!U37-Lønmodtager!V37","v":0},null,{"$f":"IF(Lønmodtager!A86=\"ÅÅÅ\",\"\",Lønmodtager!A86&REPT(\".\",200))","v":""},{"$f":"IF(Lønmodtager!A86=\"ÅÅÅ\",\"\",Lønmodtager!H86)","v":""},{"$f":"Lønmodtager!M86","v":0},{"$f":"Lønmodtager!L86","v":0},{"$f":"Lønmodtager!U86-Lønmodtager!V86","v":0}]
[{"$f":"IF(Lønmodtager!A38=\"ÅÅÅ\",\"\",Lønmodtager!A38&REPT(\".\",200))","v":""},{"$f":"IF(Lønmodtager!A38=\"ÅÅÅ\",\"\",Lønmodtager!H38)","v":""},{"$f":"Lønmodtager!M38","v":0},{"$f":"Lønmodtager!L38","v":0},{"$f":"Lønmodtager!U38-Lønmodtager!V38","v":0},null,{"$f":"IF(Lønmodtager!A87=\"ÅÅÅ\",\"\",Lønmodtager!A87&REPT(\".\",200))","v":""},{"$f":"IF(Lønmodtager!A87=\"ÅÅÅ\",\"\",Lønmodtager!H87)","v":""},{"$f":"Lønmodtager!M87","v":0},{"$f":"Lønmodtager!L87","v":0},{"$f":"Lønmodtager!U87-Lønmodtager!V87","v":0}]
[{"$f":"IF(Lønmodtager!A39=\"ÅÅÅ\",\"\",Lønmodtager!A39&REPT(\".\",200))","v":""},{"$f":"IF(Lønmodtager!A39=\"ÅÅÅ\",\"\",Lønmodtager!H39)","v":""},{"$f":"Lønmodtager!M39","v":0},{"$f":"Lønmodtager!L39","v":0},{"$f":"Lønmodtager!U39-Lønmodtager!V39","v":0},null,{"$f":"IF(Lønmodtager!A88=\"ÅÅÅ\",\"\",Lønmodtager!A88&REPT(\".\",200))","v":""},{"$f":"IF(Lønmodtager!A88=\"ÅÅÅ\",\"\",Lønmodtager!H88)","v":""},{"$f":"Lønmodtager!M88","v":0},{"$f":"Lønmodtager!L88","v":0},{"$f":"Lønmodtager!U88-Lønmodtager!V88","v":0}]
[{"$f":"IF(Lønmodtager!A40=\"ÅÅÅ\",\"\",Lønmodtager!A40&REPT(\".\",200))","v":""},{"$f":"IF(Lønmodtager!A40=\"ÅÅÅ\",\"\",Lønmodtager!H40)","v":""},{"$f":"Lønmodtager!M40","v":0},{"$f":"Lønmodtager!L40","v":0},{"$f":"Lønmodtager!U40-Lønmodtager!V40","v":0},null,{"$f":"IF(Lønmodtager!A89=\"ÅÅÅ\",\"\",Lønmodtager!A89&REPT(\".\",200))","v":""},{"$f":"IF(Lønmodtager!A89=\"ÅÅÅ\",\"\",Lønmodtager!H89)","v":""},{"$f":"Lønmodtager!M89","v":0},{"$f":"Lønmodtager!L89","v":0},{"$f":"Lønmodtager!U89-Lønmodtager!V89","v":0}]
[{"$f":"IF(Lønmodtager!A41=\"ÅÅÅ\",\"\",Lønmodtager!A41&REPT(\".\",200))","v":""},{"$f":"IF(Lønmodtager!A41=\"ÅÅÅ\",\"\",Lønmodtager!H41)","v":""},{"$f":"Lønmodtager!M41","v":0},{"$f":"Lønmodtager!L41","v":0},{"$f":"Lønmodtager!U41-Lønmodtager!V41","v":0},null,{"$f":"IF(Lønmodtager!A90=\"ÅÅÅ\",\"\",Lønmodtager!A90&REPT(\".\",200))","v":""},{"$f":"IF(Lønmodtager!A90=\"ÅÅÅ\",\"\",Lønmodtager!H90)","v":""},{"$f":"Lønmodtager!M90","v":0},{"$f":"Lønmodtager!L90","v":0},{"$f":"Lønmodtager!U90-Lønmodtager!V90","v":0}]
[{"$f":"IF(Lønmodtager!A42=\"ÅÅÅ\",\"\",Lønmodtager!A42&REPT(\".\",200))","v":""},{"$f":"IF(Lønmodtager!A42=\"ÅÅÅ\",\"\",Lønmodtager!H42)","v":""},{"$f":"Lønmodtager!M42","v":0},{"$f":"Lønmodtager!L42","v":0},{"$f":"Lønmodtager!U42-Lønmodtager!V42","v":0},null,{"$f":"IF(Lønmodtager!A91=\"ÅÅÅ\",\"\",Lønmodtager!A91&REPT(\".\",200))","v":""},{"$f":"IF(Lønmodtager!A91=\"ÅÅÅ\",\"\",Lønmodtager!H91)","v":""},{"$f":"Lønmodtager!M91","v":0},{"$f":"Lønmodtager!L91","v":0},{"$f":"Lønmodtager!U91-Lønmodtager!V91","v":0}]
[{"$f":"IF(Lønmodtager!A43=\"ÅÅÅ\",\"\",Lønmodtager!A43&REPT(\".\",200))","v":""},{"$f":"IF(Lønmodtager!A43=\"ÅÅÅ\",\"\",Lønmodtager!H43)","v":""},{"$f":"Lønmodtager!M43","v":0},{"$f":"Lønmodtager!L43","v":0},{"$f":"Lønmodtager!U43-Lønmodtager!V43","v":0},null,{"$f":"IF(Lønmodtager!A92=\"ÅÅÅ\",\"\",Lønmodtager!A92&REPT(\".\",200))","v":""},{"$f":"IF(Lønmodtager!A92=\"ÅÅÅ\",\"\",Lønmodtager!H92)","v":""},{"$f":"Lønmodtager!M92","v":0},{"$f":"Lønmodtager!L92","v":0},{"$f":"Lønmodtager!U92-Lønmodtager!V92","v":0}]
[{"$f":"IF(Lønmodtager!A44=\"ÅÅÅ\",\"\",Lønmodtager!A44&REPT(\".\",200))","v":""},{"$f":"IF(Lønmodtager!A44=\"ÅÅÅ\",\"\",Lønmodtager!H44)","v":""},{"$f":"Lønmodtager!M44","v":0},{"$f":"Lønmodtager!L44","v":0},{"$f":"Lønmodtager!U44-Lønmodtager!V44","v":0},null,{"$f":"IF(Lønmodtager!A93=\"ÅÅÅ\",\"\",Lønmodtager!A93&REPT(\".\",200))","v":""},{"$f":"IF(Lønmodtager!A93=\"ÅÅÅ\",\"\",Lønmodtager!H93)","v":""},{"$f":"Lønmodtager!M93","v":0},{"$f":"Lønmodtager!L93","v":0},{"$f":"Lønmodtager!U93-Lønmodtager!V93","v":0}]
[{"$f":"IF(Lønmodtager!A45=\"ÅÅÅ\",\"\",Lønmodtager!A45&REPT(\".\",200))","v":""},{"$f":"IF(Lønmodtager!A45=\"ÅÅÅ\",\"\",Lønmodtager!H45)","v":""},{"$f":"Lønmodtager!M45","v":0},{"$f":"Lønmodtager!L45","v":0},{"$f":"Lønmodtager!U45-Lønmodtager!V45","v":0},null,{"$f":"IF(Lønmodtager!A94=\"ÅÅÅ\",\"\",Lønmodtager!A94&REPT(\".\",200))","v":""},{"$f":"IF(Lønmodtager!A94=\"ÅÅÅ\",\"\",Lønmodtager!H94)","v":""},{"$f":"Lønmodtager!M94","v":0},{"$f":"Lønmodtager!L94","v":0},{"$f":"Lønmodtager!U94-Lønmodtager!V94","v":0}]
[{"$f":"IF(Lønmodtager!A46=\"ÅÅÅ\",\"\",Lønmodtager!A46&REPT(\".\",200))","v":""},{"$f":"IF(Lønmodtager!A46=\"ÅÅÅ\",\"\",Lønmodtager!H46)","v":""},{"$f":"Lønmodtager!M46","v":0},{"$f":"Lønmodtager!L46","v":0},{"$f":"Lønmodtager!U46-Lønmodtager!V46","v":0},null,{"$f":"IF(Lønmodtager!A95=\"ÅÅÅ\",\"\",Lønmodtager!A95&REPT(\".\",200))","v":""},{"$f":"IF(Lønmodtager!A95=\"ÅÅÅ\",\"\",Lønmodtager!H95)","v":""},{"$f":"Lønmodtager!M95","v":0},{"$f":"Lønmodtager!L95","v":0},{"$f":"Lønmodtager!U95-Lønmodtager!V95","v":0}]
[{"$f":"IF(Lønmodtager!A47=\"ÅÅÅ\",\"\",Lønmodtager!A47&REPT(\".\",200))","v":""},{"$f":"IF(Lønmodtager!A47=\"ÅÅÅ\",\"\",Lønmodtager!H47)","v":""},{"$f":"Lønmodtager!M47","v":0},{"$f":"Lønmodtager!L47","v":0},{"$f":"Lønmodtager!U47-Lønmodtager!V47","v":0},null,{"$f":"IF(Lønmodtager!A96=\"ÅÅÅ\",\"\",Lønmodtager!A96&REPT(\".\",200))","v":""},{"$f":"IF(Lønmodtager!A96=\"ÅÅÅ\",\"\",Lønmodtager!H96)","v":""},{"$f":"Lønmodtager!M96","v":0},{"$f":"Lønmodtager!L96","v":0},{"$f":"Lønmodtager!U96-Lønmodtager!V96","v":0}]
[{"$f":"IF(Lønmodtager!A48=\"ÅÅÅ\",\"\",Lønmodtager!A48&REPT(\".\",200))","v":""},{"$f":"IF(Lønmodtager!A48=\"ÅÅÅ\",\"\",Lønmodtager!H48)","v":""},{"$f":"Lønmodtager!M48","v":0},{"$f":"Lønmodtager!L48","v":0},{"$f":"Lønmodtager!U48-Lønmodtager!V48","v":0},null,{"$f":"IF(Lønmodtager!A97=\"ÅÅÅ\",\"\",Lønmodtager!A97&REPT(\".\",200))","v":""},{"$f":"IF(Lønmodtager!A97=\"ÅÅÅ\",\"\",Lønmodtager!H97)","v":""},{"$f":"Lønmodtager!M97","v":0},{"$f":"Lønmodtager!L97","v":0},{"$f":"Lønmodtager!U97-Lønmodtager!V97","v":0}]
[{"$f":"IF(Lønmodtager!A49=\"ÅÅÅ\",\"\",Lønmodtager!A49&REPT(\".\",200))","v":""},{"$f":"IF(Lønmodtager!A49=\"ÅÅÅ\",\"\",Lønmodtager!H49)","v":""},{"$f":"Lønmodtager!M49","v":0},{"$f":"Lønmodtager!L49","v":0},{"$f":"Lønmodtager!U49-Lønmodtager!V49","v":0},null,{"$f":"IF(Lønmodtager!A98=\"ÅÅÅ\",\"\",Lønmodtager!A98&REPT(\".\",200))","v":""},{"$f":"IF(Lønmodtager!A98=\"ÅÅÅ\",\"\",Lønmodtager!H98)","v":""},{"$f":"Lønmodtager!M98","v":0},{"$f":"Lønmodtager!L98","v":0},{"$f":"Lønmodtager!U98-Lønmodtager!V98","v":0}]
[{"$f":"IF(Lønmodtager!A50=\"ÅÅÅ\",\"\",Lønmodtager!A50&REPT(\".\",200))","v":""},{"$f":"IF(Lønmodtager!A50=\"ÅÅÅ\",\"\",Lønmodtager!H50)","v":""},{"$f":"Lønmodtager!M50","v":0},{"$f":"Lønmodtager!L50","v":0},{"$f":"Lønmodtager!U50-Lønmodtager!V50","v":0},null,{"$f":"IF(Lønmodtager!A99=\"ÅÅÅ\",\"\",Lønmodtager!A99&REPT(\".\",200))","v":""},{"$f":"IF(Lønmodtager!A99=\"ÅÅÅ\",\"\",Lønmodtager!H99)","v":""},{"$f":"Lønmodtager!M99","v":0},{"$f":"Lønmodtager!L99","v":0},{"$f":"Lønmodtager!U99-Lønmodtager!V99","v":0}]
[{"$f":"IF(Lønmodtager!A51=\"ÅÅÅ\",\"\",Lønmodtager!A51&REPT(\".\",200))","v":""},{"$f":"IF(Lønmodtager!A51=\"ÅÅÅ\",\"\",Lønmodtager!H51)","v":""},{"$f":"Lønmodtager!M51","v":0},{"$f":"Lønmodtager!L51","v":0},{"$f":"Lønmodtager!U51-Lønmodtager!V51","v":0}]
[{"$f":"IF(Lønmodtager!A52=\"ÅÅÅ\",\"\",Lønmodtager!A52&REPT(\".\",200))","v":""},{"$f":"IF(Lønmodtager!A52=\"ÅÅÅ\",\"\",Lønmodtager!H52)","v":""},{"$f":"Lønmodtager!M52","v":0},{"$f":"Lønmodtager!L52","v":0},{"$f":"Lønmodtager!U52-Lønmodtager!V52","v":0}]
[{"$f":"IF(Lønmodtager!A53=\"ÅÅÅ\",\"\",Lønmodtager!A53&REPT(\".\",200))","v":""},{"$f":"IF(Lønmodtager!A53=\"ÅÅÅ\",\"\",Lønmodtager!H53)","v":""},{"$f":"Lønmodtager!M53","v":0},{"$f":"Lønmodtager!L53","v":0},{"$f":"Lønmodtager!U53-Lønmodtager!V53","v":0}]
[null,null,null,{"$f":"IF(D68<>0,\"-------------\",\"\")","v":""},{"$f":"IF(E68<>0,\"-------------\",\"\")","v":""},null,null,null,null,{"$f":"IF(J68<>0,\"-------------\",\"\")","v":""},{"$f":"IF(K68<>0,\"-------------\",\"\")","v":""}]
[{"$f":"IF(D68<>0,\"Feriepenge\",\"\")&IF((D68<>0)*(E68<>0),\" & \",\"\")&IF(E68<>0,\"Skyldig SH\",\"\")","v":""},null,null,{"$f":"SUM(D18:D66)","v":0},{"$f":"SUM(E18:E66)","v":0},null,{"$f":"IF(J68<>0,\"Feriepenge\",\"\")&IF((J68<>0)*(K68<>0),\" & \",\"\")&IF(K68<>0,\"Skyldig SH\",\"\")","v":""},null,null,{"$f":"SUM(J18:J66)","v":0},{"$f":"SUM(K18:K66)","v":0}]

{"sheet":"Afholdt-Ferie","index":6,"n_rows":50,"n_cols":18,"rows_kept":50,"cut":false,"hidden":false,"merged":[[1,3,1,15],[0,3,0,15]]}
[{"$f":"\"Afholdt ferie i kalenderåret \"&'ATP-Feriepenge-SH'!K3","v":"Afholdt ferie i kalenderåret 2019"},null,null,"Oplyst i antal dage"]
[null,null,null,"1 uge = 5 dage"]
[{"$f":"'ATP-Feriepenge-SH'!A3","v":"SE-NR.........................."}]
[{"$f":"'ATP-Feriepenge-SH'!A4","v":"TestVirk.navn"},null,"S","J","F","M","A","M","J","J","A","S","O","N","D","S","S","S"]
[{"$f":"'ATP-Feriepenge-SH'!A5","v":"v/Test.Indehaver"},null,"u","a","e","a","p","a","u","u","u","e","k","o","e","u","u","u"]
[{"$f":"'ATP-Feriepenge-SH'!A6","v":"Test.Adr.Virk"},null,"m","n","b","r","r","j","n","l","g","p","t","v","c","m","m","m"]
[{"$f":"'ATP-Feriepenge-SH'!A7","v":"1234 Testby"},null,null,"u","r","t","i",null,"i","i","u","t","o","e","e"]
[null,null,"A","a","u","s","l",null,null,null,"s","e","b","m","m","A","A","A"]
[null,null,"n","r","a",null,null,null,null,null,"t","m","e","b","b","n","n","n"]
[null,null,"t",null,"r",null,null,null,null,null,null,"b","r","e","e","t","t","t"]
[null,null,"a",null,null,null,null,null,null,null,null,"e",null,"r","r","a","a","a"]
[null,null,"l",null,null,null,null,null,null,null,null,"r",null,null,null,"l","l","l"]
[]
[null,null,"Dage",null,null,null,null,null,null,null,null,null,null,null,null,"Dage","Dage","Dage"]
[null,null,{"$f":"'ATP-Feriepenge-SH'!K3-1","v":2018},null,null,null,null,null,null,null,null,null,null,null,null,{"$f":"'ATP-Feriepenge-SH'!K3","v":"2019"},"ferieåret",{"$f":"'ATP-Feriepenge-SH'!K3","v":"2019"}]
[null,null,"0105-",null,null,null,null,null,null,null,null,null,null,null,null,"0101-",{"$f":"\"01.05.\"&RIGHT(C15,2)","v":"01.05.18"},"0105-"]
[null,null,3112,null,null,null,null,null,null,null,null,null,null,null,null,3004,{"$f":"\"30.04.\"&RIGHT(R15,2)","v":"30.04.19"},3112]
[{"$f":"IF(LEFT('ATP-Feriepenge-SH'!A18,2)<>\"ÅÅ\",'ATP-Feriepenge-SH'!A18,\"\")","v":"Søgenavn indtastes i celle F7........................................................................................................................................................................................................"},null," ",null,null,null,null,null,null,null,null,null,null,null,null,{"$f":"SUM(D18:G18)","v":0},{"$f":"SUM(C18:G18)","v":0},{"$f":"SUM(H18:O18)","v":0}]
[{"$f":"IF(LEFT('ATP-Feriepenge-SH'!A19,2)<>\"ÅÅ\",'ATP-Feriepenge-SH'!A19,\"\")","v":"Testperson........................................................................................................................................................................................................"},null," "," ",null,null,null,null,null,null,null,null,null,null,null,0,0,{"$f":"SUM(H19:O19)","v":0}]
[{"$f":"IF(LEFT('ATP-Feriepenge-SH'!A20,2)<>\"ÅÅ\",'ATP-Feriepenge-SH'!A20,\"\")","v":""},null," "," ",null,null,null,null,null,null,null,null,null,null,null,0,0,{"$f":"SUM(H20:O20)","v":0}]
[{"$f":"IF(LEFT('ATP-Feriepenge-SH'!A21,2)<>\"ÅÅ\",'ATP-Feriepenge-SH'!A21,\"\")","v":""},null," "," ",null,null,null,null,null,null,null,null,null,null,null,0,0,{"$f":"SUM(H21:O21)","v":0}]
[{"$f":"IF(LEFT('ATP-Feriepenge-SH'!A22,2)<>\"ÅÅ\",'ATP-Feriepenge-SH'!A22,\"\")","v":""},null,null,null,null,null,null,null,null,null,null,null,null,null,null,0,0,{"$f":"SUM(H22:O22)","v":0}]
[{"$f":"IF(LEFT('ATP-Feriepenge-SH'!A23,2)<>\"ÅÅ\",'ATP-Feriepenge-SH'!A23,\"\")","v":""},null,null," ",null,null,null,null,null,null,null,null,null,null,null,0,0,{"$f":"SUM(H23:O23)","v":0}]
[{"$f":"IF(LEFT('ATP-Feriepenge-SH'!A24,2)<>\"ÅÅ\",'ATP-Feriepenge-SH'!A24,\"\")","v":""},null," "," ",null,null,null,null,null,null,null,null,null,null,null,0,0,{"$f":"SUM(H24:O24)","v":0}]
[{"$f":"IF(LEFT('ATP-Feriepenge-SH'!A25,2)<>\"ÅÅ\",'ATP-Feriepenge-SH'!A25,\"\")","v":""},null," "," ",null,null,null,null,null,null,null,null,null,null,null,0,0,{"$f":"SUM(H25:O25)","v":0}]
[{"$f":"IF(LEFT('ATP-Feriepenge-SH'!A26,2)<>\"ÅÅ\",'ATP-Feriepenge-SH'!A26,\"\")","v":""},null," "," ",null,null,null,null,null,null,null,null,null,null,null,0,0,{"$f":"SUM(H26:O26)","v":0}]
[{"$f":"IF(LEFT('ATP-Feriepenge-SH'!A27,2)<>\"ÅÅ\",'ATP-Feriepenge-SH'!A27,\"\")","v":""},null," "," ",null,null,null,null,null,null,null,null,null,null,null,0,0,{"$f":"SUM(H27:O27)","v":0}]
[{"$f":"IF(LEFT('ATP-Feriepenge-SH'!A28,2)<>\"ÅÅ\",'ATP-Feriepenge-SH'!A28,\"\")","v":""},null," "," ",null,null,null,null,null,null,null,null,null,null,null,0,0,{"$f":"SUM(H28:O28)","v":0}]
[{"$f":"IF(LEFT('ATP-Feriepenge-SH'!A29,2)<>\"ÅÅ\",'ATP-Feriepenge-SH'!A29,\"\")","v":""},null," "," ",null,null,null,null,null,null,null,null,null,null,null,0,0,{"$f":"SUM(H29:O29)","v":0}]
[{"$f":"IF(LEFT('ATP-Feriepenge-SH'!A30,2)<>\"ÅÅ\",'ATP-Feriepenge-SH'!A30,\"\")","v":""},null," "," ",null,null,null,null,null,null,null,null,null,null,null,0,0,{"$f":"SUM(H30:O30)","v":0}]
[{"$f":"IF(LEFT('ATP-Feriepenge-SH'!A31,2)<>\"ÅÅ\",'ATP-Feriepenge-SH'!A31,\"\")","v":""},null," "," ",null,null,null,null,null,null,null,null,null,null,null,0,0,{"$f":"SUM(H31:O31)","v":0}]
[{"$f":"IF(LEFT('ATP-Feriepenge-SH'!A32,2)<>\"ÅÅ\",'ATP-Feriepenge-SH'!A32,\"\")","v":""},null," "," ",null,null,null,null,null,null,null,null,null,null,null,0,0,{"$f":"SUM(H32:O32)","v":0}]
[{"$f":"IF(LEFT('ATP-Feriepenge-SH'!A33,2)<>\"ÅÅ\",'ATP-Feriepenge-SH'!A33,\"\")","v":""},null," "," ",null,null,null,null,null,null,null,null,null,null,null,0,0,{"$f":"SUM(H33:O33)","v":0}]
[{"$f":"IF(LEFT('ATP-Feriepenge-SH'!A34,2)<>\"ÅÅ\",'ATP-Feriepenge-SH'!A34,\"\")","v":""},null," "," ",null,null,null,null,null,null,null,null,null,null,null,0,0,{"$f":"SUM(H34:O34)","v":0}]
[{"$f":"IF(LEFT('ATP-Feriepenge-SH'!A35,2)<>\"ÅÅ\",'ATP-Feriepenge-SH'!A35,\"\")","v":""},null," "," ",null,null,null,null,null,null,null,null,null,null,null,0,0,{"$f":"SUM(H35:O35)","v":0}]
[{"$f":"IF(LEFT('ATP-Feriepenge-SH'!A36,2)<>\"ÅÅ\",'ATP-Feriepenge-SH'!A36,\"\")","v":""},null," "," ",null,null,null,null,null,null,null,null,null,null,null,0,0,{"$f":"SUM(H36:O36)","v":0}]
[{"$f":"IF(LEFT('ATP-Feriepenge-SH'!A37,2)<>\"ÅÅ\",'ATP-Feriepenge-SH'!A37,\"\")","v":""},null," "," ",null,null,null,null,null,null,null,null,null,null,null,0,0,{"$f":"SUM(H37:O37)","v":0}]
[{"$f":"IF(LEFT('ATP-Feriepenge-SH'!A38,2)<>\"ÅÅ\",'ATP-Feriepenge-SH'!A38,\"\")","v":""},null," "," ",null,null,null,null,null,null,null,null,null,null,null,0,0,{"$f":"SUM(H38:O38)","v":0}]
[{"$f":"IF(LEFT('ATP-Feriepenge-SH'!A39,2)<>\"ÅÅ\",'ATP-Feriepenge-SH'!A39,\"\")","v":""},null," "," ",null,null,null,null,null,null,null,null,null,null,null,0,0,{"$f":"SUM(H39:O39)","v":0}]
[{"$f":"IF(LEFT('ATP-Feriepenge-SH'!A40,2)<>\"ÅÅ\",'ATP-Feriepenge-SH'!A40,\"\")","v":""},null,null," ",null,null,null,null,null,null,null,null,null,null,null,0,0,{"$f":"SUM(H40:O40)","v":0}]
[{"$f":"IF(LEFT('ATP-Feriepenge-SH'!A41,2)<>\"ÅÅ\",'ATP-Feriepenge-SH'!A41,\"\")","v":""},null," "," ",null,null,null,null,null,null,null,null,null,null,null,0,0,{"$f":"SUM(H41:O41)","v":0}]
[{"$f":"IF(LEFT('ATP-Feriepenge-SH'!A42,2)<>\"ÅÅ\",'ATP-Feriepenge-SH'!A42,\"\")","v":""},null,null," ",null,null,null,null,null,null,null,null,null,null,null,0,0,{"$f":"SUM(H42:O42)","v":0}]
[{"$f":"IF(LEFT('ATP-Feriepenge-SH'!A43,2)<>\"ÅÅ\",'ATP-Feriepenge-SH'!A43,\"\")","v":""},null," "," ",null,null,null,null,null,null,null,null,null,null,null,0,0,{"$f":"SUM(H43:O43)","v":0}]
[{"$f":"IF(LEFT('ATP-Feriepenge-SH'!A44,2)<>\"ÅÅ\",'ATP-Feriepenge-SH'!A44,\"\")","v":""},null," "," ",null,null,null,null,null,null,null,null,null,null,null,0,0,{"$f":"SUM(H44:O44)","v":0}]
[{"$f":"IF(LEFT('ATP-Feriepenge-SH'!A45,2)<>\"ÅÅ\",'ATP-Feriepenge-SH'!A45,\"\")","v":""},null," "," ",null,null,null,null,null,null,null,null,null,null,null,0,0,{"$f":"SUM(H45:O45)","v":0}]
[{"$f":"IF(LEFT('ATP-Feriepenge-SH'!A46,2)<>\"ÅÅ\",'ATP-Feriepenge-SH'!A46,\"\")","v":""},null," "," ",null,null,null,null,null,null,null,null,null,null,null,0,0,{"$f":"SUM(H46:O46)","v":0}]
[{"$f":"IF(LEFT('ATP-Feriepenge-SH'!A47,2)<>\"ÅÅ\",'ATP-Feriepenge-SH'!A47,\"\")","v":""},null," "," ",null,null,null,null,null,null,null,null,null,null,null,0,0,{"$f":"SUM(H47:O47)","v":0}]
[{"$f":"IF(LEFT('ATP-Feriepenge-SH'!A48,2)<>\"ÅÅ\",'ATP-Feriepenge-SH'!A48,\"\")","v":""},null," "," ",null,null,null,null,null,null,null,null,null,null,null,0,0,{"$f":"SUM(H48:O48)","v":0}]
[{"$f":"IF(LEFT('ATP-Feriepenge-SH'!A49,2)<>\"ÅÅ\",'ATP-Feriepenge-SH'!A49,\"\")","v":""},null," "," ",null,null,null,null,null,null,null,null,null,null,null,0,0,{"$f":"SUM(H49:O49)","v":0}]
[null,null," "]

{"sheet":"Pension","index":7,"n_rows":105,"n_cols":5,"rows_kept":105,"cut":false,"hidden":false,"merged":[]}
[{"$f":"Lønseddel!D2","v":"SE-NR.........................."},{"$f":"Lønseddel!E2","v":"12 34 56 78"},null,null,{"$f":"Lønseddel!D10","v":"Januar"}]
[{"$f":"Lønseddel!D3","v":"TestVirk.navn"},null,null,null,{"$f":"Lønseddel!E10","v":"2019"}]
[{"$f":"Lønseddel!D4","v":"v/Test.Indehaver"}]
[{"$f":"Lønseddel!D5","v":"Test.Adr.Virk"}]
[{"$f":"Lønseddel!D6","v":"1234 Testby"}]
[]
[{"$f":"IF(Lønseddel!C80<>0,\"Pension indeholder IKKE den ej År-Til-Dato opdaterede lønseddel\",\"\")","v":""}]
[]
["Afregning af Pension","Cpr-nr.","Pension ÅTD","Tidl. Indb.","Indbetales"]
[]
[{"$f":"IF(Lønmodtager!A5=\"ÅÅÅ\",\"\",Lønmodtager!A5&REPT(\".\",200))","v":"Søgenavn indtastes i celle F7........................................................................................................................................................................................................"},{"$f":"IF(Lønmodtager!A5=\"ÅÅÅ\",\"\",Lønmodtager!H5)","v":"000000-0000"},{"$f":"IF(Lønmodtager!A5=\"ÅÅÅ\",0,Lønmodtager!AF5)","v":0},{"$f":"IF(Lønmodtager!A5=\"ÅÅÅ\",0,Lønmodtager!AN5)","v":0},{"$f":"C11-D11","v":0}]
[{"$f":"IF(Lønmodtager!A6=\"ÅÅÅ\",\"\",Lønmodtager!A6&REPT(\".\",200))","v":"Testperson........................................................................................................................................................................................................"},{"$f":"IF(Lønmodtager!A6=\"ÅÅÅ\",\"\",Lønmodtager!H6)","v":"12345678-1234"},{"$f":"IF(Lønmodtager!A6=\"ÅÅÅ\",0,Lønmodtager!AF6)","v":0},{"$f":"IF(Lønmodtager!A6=\"ÅÅÅ\",0,Lønmodtager!AN6)","v":0},{"$f":"C12-D12","v":0}]
[{"$f":"IF(Lønmodtager!A7=\"ÅÅÅ\",\"\",Lønmodtager!A7&REPT(\".\",200))","v":""},{"$f":"IF(Lønmodtager!A7=\"ÅÅÅ\",\"\",Lønmodtager!H7)","v":""},{"$f":"IF(Lønmodtager!A7=\"ÅÅÅ\",0,Lønmodtager!AF7)","v":0},{"$f":"IF(Lønmodtager!A7=\"ÅÅÅ\",0,Lønmodtager!AN7)","v":0},{"$f":"C13-D13","v":0}]
[{"$f":"IF(Lønmodtager!A8=\"ÅÅÅ\",\"\",Lønmodtager!A8&REPT(\".\",200))","v":""},{"$f":"IF(Lønmodtager!A8=\"ÅÅÅ\",\"\",Lønmodtager!H8)","v":""},{"$f":"IF(Lønmodtager!A8=\"ÅÅÅ\",0,Lønmodtager!AF8)","v":0},{"$f":"IF(Lønmodtager!A8=\"ÅÅÅ\",0,Lønmodtager!AN8)","v":0},{"$f":"C14-D14","v":0}]
[{"$f":"IF(Lønmodtager!A9=\"ÅÅÅ\",\"\",Lønmodtager!A9&REPT(\".\",200))","v":""},{"$f":"IF(Lønmodtager!A9=\"ÅÅÅ\",\"\",Lønmodtager!H9)","v":""},{"$f":"IF(Lønmodtager!A9=\"ÅÅÅ\",0,Lønmodtager!AF9)","v":0},{"$f":"IF(Lønmodtager!A9=\"ÅÅÅ\",0,Lønmodtager!AN9)","v":0},{"$f":"C15-D15","v":0}]
[{"$f":"IF(Lønmodtager!A10=\"ÅÅÅ\",\"\",Lønmodtager!A10&REPT(\".\",200))","v":""},{"$f":"IF(Lønmodtager!A10=\"ÅÅÅ\",\"\",Lønmodtager!H10)","v":""},{"$f":"IF(Lønmodtager!A10=\"ÅÅÅ\",0,Lønmodtager!AF10)","v":0},{"$f":"IF(Lønmodtager!A10=\"ÅÅÅ\",0,Lønmodtager!AN10)","v":0},{"$f":"C16-D16","v":0}]
[{"$f":"IF(Lønmodtager!A11=\"ÅÅÅ\",\"\",Lønmodtager!A11&REPT(\".\",200))","v":""},{"$f":"IF(Lønmodtager!A11=\"ÅÅÅ\",\"\",Lønmodtager!H11)","v":""},{"$f":"IF(Lønmodtager!A11=\"ÅÅÅ\",0,Lønmodtager!AF11)","v":0},{"$f":"IF(Lønmodtager!A11=\"ÅÅÅ\",0,Lønmodtager!AN11)","v":0},{"$f":"C17-D17","v":0}]
[{"$f":"IF(Lønmodtager!A12=\"ÅÅÅ\",\"\",Lønmodtager!A12&REPT(\".\",200))","v":""},{"$f":"IF(Lønmodtager!A12=\"ÅÅÅ\",\"\",Lønmodtager!H12)","v":""},{"$f":"IF(Lønmodtager!A12=\"ÅÅÅ\",0,Lønmodtager!AF12)","v":0},{"$f":"IF(Lønmodtager!A12=\"ÅÅÅ\",0,Lønmodtager!AN12)","v":0},{"$f":"C18-D18","v":0}]
[{"$f":"IF(Lønmodtager!A13=\"ÅÅÅ\",\"\",Lønmodtager!A13&REPT(\".\",200))","v":""},{"$f":"IF(Lønmodtager!A13=\"ÅÅÅ\",\"\",Lønmodtager!H13)","v":""},{"$f":"IF(Lønmodtager!A13=\"ÅÅÅ\",0,Lønmodtager!AF13)","v":0},{"$f":"IF(Lønmodtager!A13=\"ÅÅÅ\",0,Lønmodtager!AN13)","v":0},{"$f":"C19-D19","v":0}]
[{"$f":"IF(Lønmodtager!A14=\"ÅÅÅ\",\"\",Lønmodtager!A14&REPT(\".\",200))","v":""},{"$f":"IF(Lønmodtager!A14=\"ÅÅÅ\",\"\",Lønmodtager!H14)","v":""},{"$f":"IF(Lønmodtager!A14=\"ÅÅÅ\",0,Lønmodtager!AF14)","v":0},{"$f":"IF(Lønmodtager!A14=\"ÅÅÅ\",0,Lønmodtager!AN14)","v":0},{"$f":"C20-D20","v":0}]
[{"$f":"IF(Lønmodtager!A15=\"ÅÅÅ\",\"\",Lønmodtager!A15&REPT(\".\",200))","v":""},{"$f":"IF(Lønmodtager!A15=\"ÅÅÅ\",\"\",Lønmodtager!H15)","v":""},{"$f":"IF(Lønmodtager!A15=\"ÅÅÅ\",0,Lønmodtager!AF15)","v":0},{"$f":"IF(Lønmodtager!A15=\"ÅÅÅ\",0,Lønmodtager!AN15)","v":0},{"$f":"C21-D21","v":0}]
[{"$f":"IF(Lønmodtager!A16=\"ÅÅÅ\",\"\",Lønmodtager!A16&REPT(\".\",200))","v":""},{"$f":"IF(Lønmodtager!A16=\"ÅÅÅ\",\"\",Lønmodtager!H16)","v":""},{"$f":"IF(Lønmodtager!A16=\"ÅÅÅ\",0,Lønmodtager!AF16)","v":0},{"$f":"IF(Lønmodtager!A16=\"ÅÅÅ\",0,Lønmodtager!AN16)","v":0},{"$f":"C22-D22","v":0}]
[{"$f":"IF(Lønmodtager!A17=\"ÅÅÅ\",\"\",Lønmodtager!A17&REPT(\".\",200))","v":""},{"$f":"IF(Lønmodtager!A17=\"ÅÅÅ\",\"\",Lønmodtager!H17)","v":""},{"$f":"IF(Lønmodtager!A17=\"ÅÅÅ\",0,Lønmodtager!AF17)","v":0},{"$f":"IF(Lønmodtager!A17=\"ÅÅÅ\",0,Lønmodtager!AN17)","v":0},{"$f":"C23-D23","v":0}]
[{"$f":"IF(Lønmodtager!A18=\"ÅÅÅ\",\"\",Lønmodtager!A18&REPT(\".\",200))","v":""},{"$f":"IF(Lønmodtager!A18=\"ÅÅÅ\",\"\",Lønmodtager!H18)","v":""},{"$f":"IF(Lønmodtager!A18=\"ÅÅÅ\",0,Lønmodtager!AF18)","v":0},{"$f":"IF(Lønmodtager!A18=\"ÅÅÅ\",0,Lønmodtager!AN18)","v":0},{"$f":"C24-D24","v":0}]
[{"$f":"IF(Lønmodtager!A19=\"ÅÅÅ\",\"\",Lønmodtager!A19&REPT(\".\",200))","v":""},{"$f":"IF(Lønmodtager!A19=\"ÅÅÅ\",\"\",Lønmodtager!H19)","v":""},{"$f":"IF(Lønmodtager!A19=\"ÅÅÅ\",0,Lønmodtager!AF19)","v":0},{"$f":"IF(Lønmodtager!A19=\"ÅÅÅ\",0,Lønmodtager!AN19)","v":0},{"$f":"C25-D25","v":0}]
[{"$f":"IF(Lønmodtager!A20=\"ÅÅÅ\",\"\",Lønmodtager!A20&REPT(\".\",200))","v":""},{"$f":"IF(Lønmodtager!A20=\"ÅÅÅ\",\"\",Lønmodtager!H20)","v":""},{"$f":"IF(Lønmodtager!A20=\"ÅÅÅ\",0,Lønmodtager!AF20)","v":0},{"$f":"IF(Lønmodtager!A20=\"ÅÅÅ\",0,Lønmodtager!AN20)","v":0},{"$f":"C26-D26","v":0}]
[{"$f":"IF(Lønmodtager!A21=\"ÅÅÅ\",\"\",Lønmodtager!A21&REPT(\".\",200))","v":""},{"$f":"IF(Lønmodtager!A21=\"ÅÅÅ\",\"\",Lønmodtager!H21)","v":""},{"$f":"IF(Lønmodtager!A21=\"ÅÅÅ\",0,Lønmodtager!AF21)","v":0},{"$f":"IF(Lønmodtager!A21=\"ÅÅÅ\",0,Lønmodtager!AN21)","v":0},{"$f":"C27-D27","v":0}]
[{"$f":"IF(Lønmodtager!A22=\"ÅÅÅ\",\"\",Lønmodtager!A22&REPT(\".\",200))","v":""},{"$f":"IF(Lønmodtager!A22=\"ÅÅÅ\",\"\",Lønmodtager!H22)","v":""},{"$f":"IF(Lønmodtager!A22=\"ÅÅÅ\",0,Lønmodtager!AF22)","v":0},{"$f":"IF(Lønmodtager!A22=\"ÅÅÅ\",0,Lønmodtager!AN22)","v":0},{"$f":"C28-D28","v":0}]
[{"$f":"IF(Lønmodtager!A23=\"ÅÅÅ\",\"\",Lønmodtager!A23&REPT(\".\",200))","v":""},{"$f":"IF(Lønmodtager!A23=\"ÅÅÅ\",\"\",Lønmodtager!H23)","v":""},{"$f":"IF(Lønmodtager!A23=\"ÅÅÅ\",0,Lønmodtager!AF23)","v":0},{"$f":"IF(Lønmodtager!A23=\"ÅÅÅ\",0,Lønmodtager!AN23)","v":0},{"$f":"C29-D29","v":0}]
[{"$f":"IF(Lønmodtager!A24=\"ÅÅÅ\",\"\",Lønmodtager!A24&REPT(\".\",200))","v":""},{"$f":"IF(Lønmodtager!A24=\"ÅÅÅ\",\"\",Lønmodtager!H24)","v":""},{"$f":"IF(Lønmodtager!A24=\"ÅÅÅ\",0,Lønmodtager!AF24)","v":0},{"$f":"IF(Lønmodtager!A24=\"ÅÅÅ\",0,Lønmodtager!AN24)","v":0},{"$f":"C30-D30","v":0}]
[{"$f":"IF(Lønmodtager!A25=\"ÅÅÅ\",\"\",Lønmodtager!A25&REPT(\".\",200))","v":""},{"$f":"IF(Lønmodtager!A25=\"ÅÅÅ\",\"\",Lønmodtager!H25)","v":""},{"$f":"IF(Lønmodtager!A25=\"ÅÅÅ\",0,Lønmodtager!AF25)","v":0},{"$f":"IF(Lønmodtager!A25=\"ÅÅÅ\",0,Lønmodtager!AN25)","v":0},{"$f":"C31-D31","v":0}]
[{"$f":"IF(Lønmodtager!A26=\"ÅÅÅ\",\"\",Lønmodtager!A26&REPT(\".\",200))","v":""},{"$f":"IF(Lønmodtager!A26=\"ÅÅÅ\",\"\",Lønmodtager!H26)","v":""},{"$f":"IF(Lønmodtager!A26=\"ÅÅÅ\",0,Lønmodtager!AF26)","v":0},{"$f":"IF(Lønmodtager!A26=\"ÅÅÅ\",0,Lønmodtager!AN26)","v":0},{"$f":"C32-D32","v":0}]
[{"$f":"IF(Lønmodtager!A27=\"ÅÅÅ\",\"\",Lønmodtager!A27&REPT(\".\",200))","v":""},{"$f":"IF(Lønmodtager!A27=\"ÅÅÅ\",\"\",Lønmodtager!H27)","v":""},{"$f":"IF(Lønmodtager!A27=\"ÅÅÅ\",0,Lønmodtager!AF27)","v":0},{"$f":"IF(Lønmodtager!A27=\"ÅÅÅ\",0,Lønmodtager!AN27)","v":0},{"$f":"C33-D33","v":0}]
[{"$f":"IF(Lønmodtager!A28=\"ÅÅÅ\",\"\",Lønmodtager!A28&REPT(\".\",200))","v":""},{"$f":"IF(Lønmodtager!A28=\"ÅÅÅ\",\"\",Lønmodtager!H28)","v":""},{"$f":"IF(Lønmodtager!A28=\"ÅÅÅ\",0,Lønmodtager!AF28)","v":0},{"$f":"IF(Lønmodtager!A28=\"ÅÅÅ\",0,Lønmodtager!AN28)","v":0},{"$f":"C34-D34","v":0}]
[{"$f":"IF(Lønmodtager!A29=\"ÅÅÅ\",\"\",Lønmodtager!A29&REPT(\".\",200))","v":""},{"$f":"IF(Lønmodtager!A29=\"ÅÅÅ\",\"\",Lønmodtager!H29)","v":""},{"$f":"IF(Lønmodtager!A29=\"ÅÅÅ\",0,Lønmodtager!AF29)","v":0},{"$f":"IF(Lønmodtager!A29=\"ÅÅÅ\",0,Lønmodtager!AN29)","v":0},{"$f":"C35-D35","v":0}]
[{"$f":"IF(Lønmodtager!A30=\"ÅÅÅ\",\"\",Lønmodtager!A30&REPT(\".\",200))","v":""},{"$f":"IF(Lønmodtager!A30=\"ÅÅÅ\",\"\",Lønmodtager!H30)","v":""},{"$f":"IF(Lønmodtager!A30=\"ÅÅÅ\",0,Lønmodtager!AF30)","v":0},{"$f":"IF(Lønmodtager!A30=\"ÅÅÅ\",0,Lønmodtager!AN30)","v":0},{"$f":"C36-D36","v":0}]
[{"$f":"IF(Lønmodtager!A31=\"ÅÅÅ\",\"\",Lønmodtager!A31&REPT(\".\",200))","v":""},{"$f":"IF(Lønmodtager!A31=\"ÅÅÅ\",\"\",Lønmodtager!H31)","v":""},{"$f":"IF(Lønmodtager!A31=\"ÅÅÅ\",0,Lønmodtager!AF31)","v":0},{"$f":"IF(Lønmodtager!A31=\"ÅÅÅ\",0,Lønmodtager!AN31)","v":0},{"$f":"C37-D37","v":0}]
[{"$f":"IF(Lønmodtager!A32=\"ÅÅÅ\",\"\",Lønmodtager!A32&REPT(\".\",200))","v":""},{"$f":"IF(Lønmodtager!A32=\"ÅÅÅ\",\"\",Lønmodtager!H32)","v":""},{"$f":"IF(Lønmodtager!A32=\"ÅÅÅ\",0,Lønmodtager!AF32)","v":0},{"$f":"IF(Lønmodtager!A32=\"ÅÅÅ\",0,Lønmodtager!AN32)","v":0},{"$f":"C38-D38","v":0}]
[{"$f":"IF(Lønmodtager!A33=\"ÅÅÅ\",\"\",Lønmodtager!A33&REPT(\".\",200))","v":""},{"$f":"IF(Lønmodtager!A33=\"ÅÅÅ\",\"\",Lønmodtager!H33)","v":""},{"$f":"IF(Lønmodtager!A33=\"ÅÅÅ\",0,Lønmodtager!AF33)","v":0},{"$f":"IF(Lønmodtager!A33=\"ÅÅÅ\",0,Lønmodtager!AN33)","v":0},{"$f":"C39-D39","v":0}]
[{"$f":"IF(Lønmodtager!A34=\"ÅÅÅ\",\"\",Lønmodtager!A34&REPT(\".\",200))","v":""},{"$f":"IF(Lønmodtager!A34=\"ÅÅÅ\",\"\",Lønmodtager!H34)","v":""},{"$f":"IF(Lønmodtager!A34=\"ÅÅÅ\",0,Lønmodtager!AF34)","v":0},{"$f":"IF(Lønmodtager!A34=\"ÅÅÅ\",0,Lønmodtager!AN34)","v":0},{"$f":"C40-D40","v":0}]
[{"$f":"IF(Lønmodtager!A35=\"ÅÅÅ\",\"\",Lønmodtager!A35&REPT(\".\",200))","v":""},{"$f":"IF(Lønmodtager!A35=\"ÅÅÅ\",\"\",Lønmodtager!H35)","v":""},{"$f":"IF(Lønmodtager!A35=\"ÅÅÅ\",0,Lønmodtager!AF35)","v":0},{"$f":"IF(Lønmodtager!A35=\"ÅÅÅ\",0,Lønmodtager!AN35)","v":0},{"$f":"C41-D41","v":0}]
[{"$f":"IF(Lønmodtager!A36=\"ÅÅÅ\",\"\",Lønmodtager!A36&REPT(\".\",200))","v":""},{"$f":"IF(Lønmodtager!A36=\"ÅÅÅ\",\"\",Lønmodtager!H36)","v":""},{"$f":"IF(Lønmodtager!A36=\"ÅÅÅ\",0,Lønmodtager!AF36)","v":0},{"$f":"IF(Lønmodtager!A36=\"ÅÅÅ\",0,Lønmodtager!AN36)","v":0},{"$f":"C42-D42","v":0}]
[{"$f":"IF(Lønmodtager!A37=\"ÅÅÅ\",\"\",Lønmodtager!A37&REPT(\".\",200))","v":""},{"$f":"IF(Lønmodtager!A37=\"ÅÅÅ\",\"\",Lønmodtager!H37)","v":""},{"$f":"IF(Lønmodtager!A37=\"ÅÅÅ\",0,Lønmodtager!AF37)","v":0},{"$f":"IF(Lønmodtager!A37=\"ÅÅÅ\",0,Lønmodtager!AN37)","v":0},{"$f":"C43-D43","v":0}]
[{"$f":"IF(Lønmodtager!A38=\"ÅÅÅ\",\"\",Lønmodtager!A38&REPT(\".\",200))","v":""},{"$f":"IF(Lønmodtager!A38=\"ÅÅÅ\",\"\",Lønmodtager!H38)","v":""},{"$f":"IF(Lønmodtager!A38=\"ÅÅÅ\",0,Lønmodtager!AF38)","v":0},{"$f":"IF(Lønmodtager!A38=\"ÅÅÅ\",0,Lønmodtager!AN38)","v":0},{"$f":"C44-D44","v":0}]
[{"$f":"IF(Lønmodtager!A39=\"ÅÅÅ\",\"\",Lønmodtager!A39&REPT(\".\",200))","v":""},{"$f":"IF(Lønmodtager!A39=\"ÅÅÅ\",\"\",Lønmodtager!H39)","v":""},{"$f":"IF(Lønmodtager!A39=\"ÅÅÅ\",0,Lønmodtager!AF39)","v":0},{"$f":"IF(Lønmodtager!A39=\"ÅÅÅ\",0,Lønmodtager!AN39)","v":0},{"$f":"C45-D45","v":0}]
[{"$f":"IF(Lønmodtager!A40=\"ÅÅÅ\",\"\",Lønmodtager!A40&REPT(\".\",200))","v":""},{"$f":"IF(Lønmodtager!A40=\"ÅÅÅ\",\"\",Lønmodtager!H40)","v":""},{"$f":"IF(Lønmodtager!A40=\"ÅÅÅ\",0,Lønmodtager!AF40)","v":0},{"$f":"IF(Lønmodtager!A40=\"ÅÅÅ\",0,Lønmodtager!AN40)","v":0},{"$f":"C46-D46","v":0}]
[{"$f":"IF(Lønmodtager!A41=\"ÅÅÅ\",\"\",Lønmodtager!A41&REPT(\".\",200))","v":""},{"$f":"IF(Lønmodtager!A41=\"ÅÅÅ\",\"\",Lønmodtager!H41)","v":""},{"$f":"IF(Lønmodtager!A41=\"ÅÅÅ\",0,Lønmodtager!AF41)","v":0},{"$f":"IF(Lønmodtager!A41=\"ÅÅÅ\",0,Lønmodtager!AN41)","v":0},{"$f":"C47-D47","v":0}]
[{"$f":"IF(Lønmodtager!A42=\"ÅÅÅ\",\"\",Lønmodtager!A42&REPT(\".\",200))","v":""},{"$f":"IF(Lønmodtager!A42=\"ÅÅÅ\",\"\",Lønmodtager!H42)","v":""},{"$f":"IF(Lønmodtager!A42=\"ÅÅÅ\",0,Lønmodtager!AF42)","v":0},{"$f":"IF(Lønmodtager!A42=\"ÅÅÅ\",0,Lønmodtager!AN42)","v":0},{"$f":"C48-D48","v":0}]
[{"$f":"IF(Lønmodtager!A43=\"ÅÅÅ\",\"\",Lønmodtager!A43&REPT(\".\",200))","v":""},{"$f":"IF(Lønmodtager!A43=\"ÅÅÅ\",\"\",Lønmodtager!H43)","v":""},{"$f":"IF(Lønmodtager!A43=\"ÅÅÅ\",0,Lønmodtager!AF43)","v":0},{"$f":"IF(Lønmodtager!A43=\"ÅÅÅ\",0,Lønmodtager!AN43)","v":0},{"$f":"C49-D49","v":0}]
[{"$f":"IF(Lønmodtager!A44=\"ÅÅÅ\",\"\",Lønmodtager!A44&REPT(\".\",200))","v":""},{"$f":"IF(Lønmodtager!A44=\"ÅÅÅ\",\"\",Lønmodtager!H44)","v":""},{"$f":"IF(Lønmodtager!A44=\"ÅÅÅ\",0,Lønmodtager!AF44)","v":0},{"$f":"IF(Lønmodtager!A44=\"ÅÅÅ\",0,Lønmodtager!AN44)","v":0},{"$f":"C50-D50","v":0}]
[{"$f":"IF(Lønmodtager!A45=\"ÅÅÅ\",\"\",Lønmodtager!A45&REPT(\".\",200))","v":""},{"$f":"IF(Lønmodtager!A45=\"ÅÅÅ\",\"\",Lønmodtager!H45)","v":""},{"$f":"IF(Lønmodtager!A45=\"ÅÅÅ\",0,Lønmodtager!AF45)","v":0},{"$f":"IF(Lønmodtager!A45=\"ÅÅÅ\",0,Lønmodtager!AN45)","v":0},{"$f":"C51-D51","v":0}]
[{"$f":"IF(Lønmodtager!A46=\"ÅÅÅ\",\"\",Lønmodtager!A46&REPT(\".\",200))","v":""},{"$f":"IF(Lønmodtager!A46=\"ÅÅÅ\",\"\",Lønmodtager!H46)","v":""},{"$f":"IF(Lønmodtager!A46=\"ÅÅÅ\",0,Lønmodtager!AF46)","v":0},{"$f":"IF(Lønmodtager!A46=\"ÅÅÅ\",0,Lønmodtager!AN46)","v":0},{"$f":"C52-D52","v":0}]
[{"$f":"IF(Lønmodtager!A47=\"ÅÅÅ\",\"\",Lønmodtager!A47&REPT(\".\",200))","v":""},{"$f":"IF(Lønmodtager!A47=\"ÅÅÅ\",\"\",Lønmodtager!H47)","v":""},{"$f":"IF(Lønmodtager!A47=\"ÅÅÅ\",0,Lønmodtager!AF47)","v":0},{"$f":"IF(Lønmodtager!A47=\"ÅÅÅ\",0,Lønmodtager!AN47)","v":0},{"$f":"C53-D53","v":0}]
[{"$f":"IF(Lønmodtager!A48=\"ÅÅÅ\",\"\",Lønmodtager!A48&REPT(\".\",200))","v":""},{"$f":"IF(Lønmodtager!A48=\"ÅÅÅ\",\"\",Lønmodtager!H48)","v":""},{"$f":"IF(Lønmodtager!A48=\"ÅÅÅ\",0,Lønmodtager!AF48)","v":0},{"$f":"IF(Lønmodtager!A48=\"ÅÅÅ\",0,Lønmodtager!AN48)","v":0},{"$f":"C54-D54","v":0}]
[{"$f":"IF(Lønmodtager!A49=\"ÅÅÅ\",\"\",Lønmodtager!A49&REPT(\".\",200))","v":""},{"$f":"IF(Lønmodtager!A49=\"ÅÅÅ\",\"\",Lønmodtager!H49)","v":""},{"$f":"IF(Lønmodtager!A49=\"ÅÅÅ\",0,Lønmodtager!AF49)","v":0},{"$f":"IF(Lønmodtager!A49=\"ÅÅÅ\",0,Lønmodtager!AN49)","v":0},{"$f":"C55-D55","v":0}]
[{"$f":"IF(Lønmodtager!A50=\"ÅÅÅ\",\"\",Lønmodtager!A50&REPT(\".\",200))","v":""},{"$f":"IF(Lønmodtager!A50=\"ÅÅÅ\",\"\",Lønmodtager!H50)","v":""},{"$f":"IF(Lønmodtager!A50=\"ÅÅÅ\",0,Lønmodtager!AF50)","v":0},{"$f":"IF(Lønmodtager!A50=\"ÅÅÅ\",0,Lønmodtager!AN50)","v":0},{"$f":"C56-D56","v":0}]
[{"$f":"IF(Lønmodtager!A51=\"ÅÅÅ\",\"\",Lønmodtager!A51&REPT(\".\",200))","v":""},{"$f":"IF(Lønmodtager!A51=\"ÅÅÅ\",\"\",Lønmodtager!H51)","v":""},{"$f":"IF(Lønmodtager!A51=\"ÅÅÅ\",0,Lønmodtager!AF51)","v":0},{"$f":"IF(Lønmodtager!A51=\"ÅÅÅ\",0,Lønmodtager!AN51)","v":0},{"$f":"C57-D57","v":0}]
[{"$f":"IF(Lønmodtager!A52=\"ÅÅÅ\",\"\",Lønmodtager!A52&REPT(\".\",200))","v":""},{"$f":"IF(Lønmodtager!A52=\"ÅÅÅ\",\"\",Lønmodtager!H52)","v":""},{"$f":"IF(Lønmodtager!A52=\"ÅÅÅ\",0,Lønmodtager!AF52)","v":0},{"$f":"IF(Lønmodtager!A52=\"ÅÅÅ\",0,Lønmodtager!AN52)","v":0},{"$f":"C58-D58","v":0}]
[{"$f":"IF(Lønmodtager!A53=\"ÅÅÅ\",\"\",Lønmodtager!A53&REPT(\".\",200))","v":""},{"$f":"IF(Lønmodtager!A53=\"ÅÅÅ\",\"\",Lønmodtager!H53)","v":""},{"$f":"IF(Lønmodtager!A53=\"ÅÅÅ\",0,Lønmodtager!AF53)","v":0},{"$f":"IF(Lønmodtager!A53=\"ÅÅÅ\",0,Lønmodtager!AN53)","v":0},{"$f":"C59-D59","v":0}]
[{"$f":"IF(Lønmodtager!A54=\"ÅÅÅ\",\"\",Lønmodtager!A54&REPT(\".\",200))","v":""},{"$f":"IF(Lønmodtager!A54=\"ÅÅÅ\",\"\",Lønmodtager!H54)","v":""},{"$f":"IF(Lønmodtager!A54=\"ÅÅÅ\",0,Lønmodtager!AF54)","v":0},{"$f":"IF(Lønmodtager!A54=\"ÅÅÅ\",0,Lønmodtager!AN54)","v":0},{"$f":"C60-D60","v":0}]
[{"$f":"IF(Lønmodtager!A55=\"ÅÅÅ\",\"\",Lønmodtager!A55&REPT(\".\",200))","v":""},{"$f":"IF(Lønmodtager!A55=\"ÅÅÅ\",\"\",Lønmodtager!H55)","v":""},{"$f":"IF(Lønmodtager!A55=\"ÅÅÅ\",0,Lønmodtager!AF55)","v":0},{"$f":"IF(Lønmodtager!A55=\"ÅÅÅ\",0,Lønmodtager!AN55)","v":0},{"$f":"C61-D61","v":0}]
[{"$f":"IF(Lønmodtager!A56=\"ÅÅÅ\",\"\",Lønmodtager!A56&REPT(\".\",200))","v":""},{"$f":"IF(Lønmodtager!A56=\"ÅÅÅ\",\"\",Lønmodtager!H56)","v":""},{"$f":"IF(Lønmodtager!A56=\"ÅÅÅ\",0,Lønmodtager!AF56)","v":0},{"$f":"IF(Lønmodtager!A56=\"ÅÅÅ\",0,Lønmodtager!AN56)","v":0},{"$f":"C62-D62","v":0}]
[{"$f":"IF(Lønmodtager!A57=\"ÅÅÅ\",\"\",Lønmodtager!A57&REPT(\".\",200))","v":""},{"$f":"IF(Lønmodtager!A57=\"ÅÅÅ\",\"\",Lønmodtager!H57)","v":""},{"$f":"IF(Lønmodtager!A57=\"ÅÅÅ\",0,Lønmodtager!AF57)","v":0},{"$f":"IF(Lønmodtager!A57=\"ÅÅÅ\",0,Lønmodtager!AN57)","v":0},{"$f":"C63-D63","v":0}]
[{"$f":"IF(Lønmodtager!A58=\"ÅÅÅ\",\"\",Lønmodtager!A58&REPT(\".\",200))","v":""},{"$f":"IF(Lønmodtager!A58=\"ÅÅÅ\",\"\",Lønmodtager!H58)","v":""},{"$f":"IF(Lønmodtager!A58=\"ÅÅÅ\",0,Lønmodtager!AF58)","v":0},{"$f":"IF(Lønmodtager!A58=\"ÅÅÅ\",0,Lønmodtager!AN58)","v":0},{"$f":"C64-D64","v":0}]
[{"$f":"IF(Lønmodtager!A59=\"ÅÅÅ\",\"\",Lønmodtager!A59&REPT(\".\",200))","v":""},{"$f":"IF(Lønmodtager!A59=\"ÅÅÅ\",\"\",Lønmodtager!H59)","v":""},{"$f":"IF(Lønmodtager!A59=\"ÅÅÅ\",0,Lønmodtager!AF59)","v":0},{"$f":"IF(Lønmodtager!A59=\"ÅÅÅ\",0,Lønmodtager!AN59)","v":0},{"$f":"C65-D65","v":0}]
[{"$f":"IF(Lønmodtager!A60=\"ÅÅÅ\",\"\",Lønmodtager!A60&REPT(\".\",200))","v":""},{"$f":"IF(Lønmodtager!A60=\"ÅÅÅ\",\"\",Lønmodtager!H60)","v":""},{"$f":"IF(Lønmodtager!A60=\"ÅÅÅ\",0,Lønmodtager!AF60)","v":0},{"$f":"IF(Lønmodtager!A60=\"ÅÅÅ\",0,Lønmodtager!AN60)","v":0},{"$f":"C66-D66","v":0}]
[{"$f":"IF(Lønmodtager!A61=\"ÅÅÅ\",\"\",Lønmodtager!A61&REPT(\".\",200))","v":""},{"$f":"IF(Lønmodtager!A61=\"ÅÅÅ\",\"\",Lønmodtager!H61)","v":""},{"$f":"IF(Lønmodtager!A61=\"ÅÅÅ\",0,Lønmodtager!AF61)","v":0},{"$f":"IF(Lønmodtager!A61=\"ÅÅÅ\",0,Lønmodtager!AN61)","v":0},{"$f":"C67-D67","v":0}]
[{"$f":"IF(Lønmodtager!A62=\"ÅÅÅ\",\"\",Lønmodtager!A62&REPT(\".\",200))","v":""},{"$f":"IF(Lønmodtager!A62=\"ÅÅÅ\",\"\",Lønmodtager!H62)","v":""},{"$f":"IF(Lønmodtager!A62=\"ÅÅÅ\",0,Lønmodtager!AF62)","v":0},{"$f":"IF(Lønmodtager!A62=\"ÅÅÅ\",0,Lønmodtager!AN62)","v":0},{"$f":"C68-D68","v":0}]
[{"$f":"IF(Lønmodtager!A63=\"ÅÅÅ\",\"\",Lønmodtager!A63&REPT(\".\",200))","v":""},{"$f":"IF(Lønmodtager!A63=\"ÅÅÅ\",\"\",Lønmodtager!H63)","v":""},{"$f":"IF(Lønmodtager!A63=\"ÅÅÅ\",0,Lønmodtager!AF63)","v":0},{"$f":"IF(Lønmodtager!A63=\"ÅÅÅ\",0,Lønmodtager!AN63)","v":0},{"$f":"C69-D69","v":0}]
[{"$f":"IF(Lønmodtager!A64=\"ÅÅÅ\",\"\",Lønmodtager!A64&REPT(\".\",200))","v":""},{"$f":"IF(Lønmodtager!A64=\"ÅÅÅ\",\"\",Lønmodtager!H64)","v":""},{"$f":"IF(Lønmodtager!A64=\"ÅÅÅ\",0,Lønmodtager!AF64)","v":0},{"$f":"IF(Lønmodtager!A64=\"ÅÅÅ\",0,Lønmodtager!AN64)","v":0},{"$f":"C70-D70","v":0}]
[{"$f":"IF(Lønmodtager!A65=\"ÅÅÅ\",\"\",Lønmodtager!A65&REPT(\".\",200))","v":""},{"$f":"IF(Lønmodtager!A65=\"ÅÅÅ\",\"\",Lønmodtager!H65)","v":""},{"$f":"IF(Lønmodtager!A65=\"ÅÅÅ\",0,Lønmodtager!AF65)","v":0},{"$f":"IF(Lønmodtager!A65=\"ÅÅÅ\",0,Lønmodtager!AN65)","v":0},{"$f":"C71-D71","v":0}]
[{"$f":"IF(Lønmodtager!A66=\"ÅÅÅ\",\"\",Lønmodtager!A66&REPT(\".\",200))","v":""},{"$f":"IF(Lønmodtager!A66=\"ÅÅÅ\",\"\",Lønmodtager!H66)","v":""},{"$f":"IF(Lønmodtager!A66=\"ÅÅÅ\",0,Lønmodtager!AF66)","v":0},{"$f":"IF(Lønmodtager!A66=\"ÅÅÅ\",0,Lønmodtager!AN66)","v":0},{"$f":"C72-D72","v":0}]
[{"$f":"IF(Lønmodtager!A67=\"ÅÅÅ\",\"\",Lønmodtager!A67&REPT(\".\",200))","v":""},{"$f":"IF(Lønmodtager!A67=\"ÅÅÅ\",\"\",Lønmodtager!H67)","v":""},{"$f":"IF(Lønmodtager!A67=\"ÅÅÅ\",0,Lønmodtager!AF67)","v":0},{"$f":"IF(Lønmodtager!A67=\"ÅÅÅ\",0,Lønmodtager!AN67)","v":0},{"$f":"C73-D73","v":0}]
[{"$f":"IF(Lønmodtager!A68=\"ÅÅÅ\",\"\",Lønmodtager!A68&REPT(\".\",200))","v":""},{"$f":"IF(Lønmodtager!A68=\"ÅÅÅ\",\"\",Lønmodtager!H68)","v":""},{"$f":"IF(Lønmodtager!A68=\"ÅÅÅ\",0,Lønmodtager!AF68)","v":0},{"$f":"IF(Lønmodtager!A68=\"ÅÅÅ\",0,Lønmodtager!AN68)","v":0},{"$f":"C74-D74","v":0}]
[{"$f":"IF(Lønmodtager!A69=\"ÅÅÅ\",\"\",Lønmodtager!A69&REPT(\".\",200))","v":""},{"$f":"IF(Lønmodtager!A69=\"ÅÅÅ\",\"\",Lønmodtager!H69)","v":""},{"$f":"IF(Lønmodtager!A69=\"ÅÅÅ\",0,Lønmodtager!AF69)","v":0},{"$f":"IF(Lønmodtager!A69=\"ÅÅÅ\",0,Lønmodtager!AN69)","v":0},{"$f":"C75-D75","v":0}]
[{"$f":"IF(Lønmodtager!A70=\"ÅÅÅ\",\"\",Lønmodtager!A70&REPT(\".\",200))","v":""},{"$f":"IF(Lønmodtager!A70=\"ÅÅÅ\",\"\",Lønmodtager!H70)","v":""},{"$f":"IF(Lønmodtager!A70=\"ÅÅÅ\",0,Lønmodtager!AF70)","v":0},{"$f":"IF(Lønmodtager!A70=\"ÅÅÅ\",0,Lønmodtager!AN70)","v":0},{"$f":"C76-D76","v":0}]
[{"$f":"IF(Lønmodtager!A71=\"ÅÅÅ\",\"\",Lønmodtager!A71&REPT(\".\",200))","v":""},{"$f":"IF(Lønmodtager!A71=\"ÅÅÅ\",\"\",Lønmodtager!H71)","v":""},{"$f":"IF(Lønmodtager!A71=\"ÅÅÅ\",0,Lønmodtager!AF71)","v":0},{"$f":"IF(Lønmodtager!A71=\"ÅÅÅ\",0,Lønmodtager!AN71)","v":0},{"$f":"C77-D77","v":0}]
[{"$f":"IF(Lønmodtager!A72=\"ÅÅÅ\",\"\",Lønmodtager!A72&REPT(\".\",200))","v":""},{"$f":"IF(Lønmodtager!A72=\"ÅÅÅ\",\"\",Lønmodtager!H72)","v":""},{"$f":"IF(Lønmodtager!A72=\"ÅÅÅ\",0,Lønmodtager!AF72)","v":0},{"$f":"IF(Lønmodtager!A72=\"ÅÅÅ\",0,Lønmodtager!AN72)","v":0},{"$f":"C78-D78","v":0}]
[{"$f":"IF(Lønmodtager!A73=\"ÅÅÅ\",\"\",Lønmodtager!A73&REPT(\".\",200))","v":""},{"$f":"IF(Lønmodtager!A73=\"ÅÅÅ\",\"\",Lønmodtager!H73)","v":""},{"$f":"IF(Lønmodtager!A73=\"ÅÅÅ\",0,Lønmodtager!AF73)","v":0},{"$f":"IF(Lønmodtager!A73=\"ÅÅÅ\",0,Lønmodtager!AN73)","v":0},{"$f":"C79-D79","v":0}]
[{"$f":"IF(Lønmodtager!A74=\"ÅÅÅ\",\"\",Lønmodtager!A74&REPT(\".\",200))","v":""},{"$f":"IF(Lønmodtager!A74=\"ÅÅÅ\",\"\",Lønmodtager!H74)","v":""},{"$f":"IF(Lønmodtager!A74=\"ÅÅÅ\",0,Lønmodtager!AF74)","v":0},{"$f":"IF(Lønmodtager!A74=\"ÅÅÅ\",0,Lønmodtager!AN74)","v":0},{"$f":"C80-D80","v":0}]
[{"$f":"IF(Lønmodtager!A75=\"ÅÅÅ\",\"\",Lønmodtager!A75&REPT(\".\",200))","v":""},{"$f":"IF(Lønmodtager!A75=\"ÅÅÅ\",\"\",Lønmodtager!H75)","v":""},{"$f":"IF(Lønmodtager!A75=\"ÅÅÅ\",0,Lønmodtager!AF75)","v":0},{"$f":"IF(Lønmodtager!A75=\"ÅÅÅ\",0,Lønmodtager!AN75)","v":0},{"$f":"C81-D81","v":0}]
[{"$f":"IF(Lønmodtager!A76=\"ÅÅÅ\",\"\",Lønmodtager!A76&REPT(\".\",200))","v":""},{"$f":"IF(Lønmodtager!A76=\"ÅÅÅ\",\"\",Lønmodtager!H76)","v":""},{"$f":"IF(Lønmodtager!A76=\"ÅÅÅ\",0,Lønmodtager!AF76)","v":0},{"$f":"IF(Lønmodtager!A76=\"ÅÅÅ\",0,Lønmodtager!AN76)","v":0},{"$f":"C82-D82","v":0}]
[{"$f":"IF(Lønmodtager!A77=\"ÅÅÅ\",\"\",Lønmodtager!A77&REPT(\".\",200))","v":""},{"$f":"IF(Lønmodtager!A77=\"ÅÅÅ\",\"\",Lønmodtager!H77)","v":""},{"$f":"IF(Lønmodtager!A77=\"ÅÅÅ\",0,Lønmodtager!AF77)","v":0},{"$f":"IF(Lønmodtager!A77=\"ÅÅÅ\",0,Lønmodtager!AN77)","v":0},{"$f":"C83-D83","v":0}]
[{"$f":"IF(Lønmodtager!A78=\"ÅÅÅ\",\"\",Lønmodtager!A78&REPT(\".\",200))","v":""},{"$f":"IF(Lønmodtager!A78=\"ÅÅÅ\",\"\",Lønmodtager!H78)","v":""},{"$f":"IF(Lønmodtager!A78=\"ÅÅÅ\",0,Lønmodtager!AF78)","v":0},{"$f":"IF(Lønmodtager!A78=\"ÅÅÅ\",0,Lønmodtager!AN78)","v":0},{"$f":"C84-D84","v":0}]
[{"$f":"IF(Lønmodtager!A79=\"ÅÅÅ\",\"\",Lønmodtager!A79&REPT(\".\",200))","v":""},{"$f":"IF(Lønmodtager!A79=\"ÅÅÅ\",\"\",Lønmodtager!H79)","v":""},{"$f":"IF(Lønmodtager!A79=\"ÅÅÅ\",0,Lønmodtager!AF79)","v":0},{"$f":"IF(Lønmodtager!A79=\"ÅÅÅ\",0,Lønmodtager!AN79)","v":0},{"$f":"C85-D85","v":0}]
[{"$f":"IF(Lønmodtager!A80=\"ÅÅÅ\",\"\",Lønmodtager!A80&REPT(\".\",200))","v":""},{"$f":"IF(Lønmodtager!A80=\"ÅÅÅ\",\"\",Lønmodtager!H80)","v":""},{"$f":"IF(Lønmodtager!A80=\"ÅÅÅ\",0,Lønmodtager!AF80)","v":0},{"$f":"IF(Lønmodtager!A80=\"ÅÅÅ\",0,Lønmodtager!AN80)","v":0},{"$f":"C86-D86","v":0}]
[{"$f":"IF(Lønmodtager!A81=\"ÅÅÅ\",\"\",Lønmodtager!A81&REPT(\".\",200))","v":""},{"$f":"IF(Lønmodtager!A81=\"ÅÅÅ\",\"\",Lønmodtager!H81)","v":""},{"$f":"IF(Lønmodtager!A81=\"ÅÅÅ\",0,Lønmodtager!AF81)","v":0},{"$f":"IF(Lønmodtager!A81=\"ÅÅÅ\",0,Lønmodtager!AN81)","v":0},{"$f":"C87-D87","v":0}]
[{"$f":"IF(Lønmodtager!A82=\"ÅÅÅ\",\"\",Lønmodtager!A82&REPT(\".\",200))","v":""},{"$f":"IF(Lønmodtager!A82=\"ÅÅÅ\",\"\",Lønmodtager!H82)","v":""},{"$f":"IF(Lønmodtager!A82=\"ÅÅÅ\",0,Lønmodtager!AF82)","v":0},{"$f":"IF(Lønmodtager!A82=\"ÅÅÅ\",0,Lønmodtager!AN82)","v":0},{"$f":"C88-D88","v":0}]
[{"$f":"IF(Lønmodtager!A83=\"ÅÅÅ\",\"\",Lønmodtager!A83&REPT(\".\",200))","v":""},{"$f":"IF(Lønmodtager!A83=\"ÅÅÅ\",\"\",Lønmodtager!H83)","v":""},{"$f":"IF(Lønmodtager!A83=\"ÅÅÅ\",0,Lønmodtager!AF83)","v":0},{"$f":"IF(Lønmodtager!A83=\"ÅÅÅ\",0,Lønmodtager!AN83)","v":0},{"$f":"C89-D89","v":0}]
[{"$f":"IF(Lønmodtager!A84=\"ÅÅÅ\",\"\",Lønmodtager!A84&REPT(\".\",200))","v":""},{"$f":"IF(Lønmodtager!A84=\"ÅÅÅ\",\"\",Lønmodtager!H84)","v":""},{"$f":"IF(Lønmodtager!A84=\"ÅÅÅ\",0,Lønmodtager!AF84)","v":0},{"$f":"IF(Lønmodtager!A84=\"ÅÅÅ\",0,Lønmodtager!AN84)","v":0},{"$f":"C90-D90","v":0}]
[{"$f":"IF(Lønmodtager!A85=\"ÅÅÅ\",\"\",Lønmodtager!A85&REPT(\".\",200))","v":""},{"$f":"IF(Lønmodtager!A85=\"ÅÅÅ\",\"\",Lønmodtager!H85)","v":""},{"$f":"IF(Lønmodtager!A85=\"ÅÅÅ\",0,Lønmodtager!AF85)","v":0},{"$f":"IF(Lønmodtager!A85=\"ÅÅÅ\",0,Lønmodtager!AN85)","v":0},{"$f":"C91-D91","v":0}]
[{"$f":"IF(Lønmodtager!A86=\"ÅÅÅ\",\"\",Lønmodtager!A86&REPT(\".\",200))","v":""},{"$f":"IF(Lønmodtager!A86=\"ÅÅÅ\",\"\",Lønmodtager!H86)","v":""},{"$f":"IF(Lønmodtager!A86=\"ÅÅÅ\",0,Lønmodtager!AF86)","v":0},{"$f":"IF(Lønmodtager!A86=\"ÅÅÅ\",0,Lønmodtager!AN86)","v":0},{"$f":"C92-D92","v":0}]
[{"$f":"IF(Lønmodtager!A87=\"ÅÅÅ\",\"\",Lønmodtager!A87&REPT(\".\",200))","v":""},{"$f":"IF(Lønmodtager!A87=\"ÅÅÅ\",\"\",Lønmodtager!H87)","v":""},{"$f":"IF(Lønmodtager!A87=\"ÅÅÅ\",0,Lønmodtager!AF87)","v":0},{"$f":"IF(Lønmodtager!A87=\"ÅÅÅ\",0,Lønmodtager!AN87)","v":0},{"$f":"C93-D93","v":0}]
[{"$f":"IF(Lønmodtager!A88=\"ÅÅÅ\",\"\",Lønmodtager!A88&REPT(\".\",200))","v":""},{"$f":"IF(Lønmodtager!A88=\"ÅÅÅ\",\"\",Lønmodtager!H88)","v":""},{"$f":"IF(Lønmodtager!A88=\"ÅÅÅ\",0,Lønmodtager!AF88)","v":0},{"$f":"IF(Lønmodtager!A88=\"ÅÅÅ\",0,Lønmodtager!AN88)","v":0},{"$f":"C94-D94","v":0}]
[{"$f":"IF(Lønmodtager!A89=\"ÅÅÅ\",\"\",Lønmodtager!A89&REPT(\".\",200))","v":""},{"$f":"IF(Lønmodtager!A89=\"ÅÅÅ\",\"\",Lønmodtager!H89)","v":""},{"$f":"IF(Lønmodtager!A89=\"ÅÅÅ\",0,Lønmodtager!AF89)","v":0},{"$f":"IF(Lønmodtager!A89=\"ÅÅÅ\",0,Lønmodtager!AN89)","v":0},{"$f":"C95-D95","v":0}]
[{"$f":"IF(Lønmodtager!A90=\"ÅÅÅ\",\"\",Lønmodtager!A90&REPT(\".\",200))","v":""},{"$f":"IF(Lønmodtager!A90=\"ÅÅÅ\",\"\",Lønmodtager!H90)","v":""},{"$f":"IF(Lønmodtager!A90=\"ÅÅÅ\",0,Lønmodtager!AF90)","v":0},{"$f":"IF(Lønmodtager!A90=\"ÅÅÅ\",0,Lønmodtager!AN90)","v":0},{"$f":"C96-D96","v":0}]
[{"$f":"IF(Lønmodtager!A91=\"ÅÅÅ\",\"\",Lønmodtager!A91&REPT(\".\",200))","v":""},{"$f":"IF(Lønmodtager!A91=\"ÅÅÅ\",\"\",Lønmodtager!H91)","v":""},{"$f":"IF(Lønmodtager!A91=\"ÅÅÅ\",0,Lønmodtager!AF91)","v":0},{"$f":"IF(Lønmodtager!A91=\"ÅÅÅ\",0,Lønmodtager!AN91)","v":0},{"$f":"C97-D97","v":0}]
[{"$f":"IF(Lønmodtager!A92=\"ÅÅÅ\",\"\",Lønmodtager!A92&REPT(\".\",200))","v":""},{"$f":"IF(Lønmodtager!A92=\"ÅÅÅ\",\"\",Lønmodtager!H92)","v":""},{"$f":"IF(Lønmodtager!A92=\"ÅÅÅ\",0,Lønmodtager!AF92)","v":0},{"$f":"IF(Lønmodtager!A92=\"ÅÅÅ\",0,Lønmodtager!AN92)","v":0},{"$f":"C98-D98","v":0}]
[{"$f":"IF(Lønmodtager!A93=\"ÅÅÅ\",\"\",Lønmodtager!A93&REPT(\".\",200))","v":""},{"$f":"IF(Lønmodtager!A93=\"ÅÅÅ\",\"\",Lønmodtager!H93)","v":""},{"$f":"IF(Lønmodtager!A93=\"ÅÅÅ\",0,Lønmodtager!AF93)","v":0},{"$f":"IF(Lønmodtager!A93=\"ÅÅÅ\",0,Lønmodtager!AN93)","v":0},{"$f":"C99-D99","v":0}]
[{"$f":"IF(Lønmodtager!A94=\"ÅÅÅ\",\"\",Lønmodtager!A94&REPT(\".\",200))","v":""},{"$f":"IF(Lønmodtager!A94=\"ÅÅÅ\",\"\",Lønmodtager!H94)","v":""},{"$f":"IF(Lønmodtager!A94=\"ÅÅÅ\",0,Lønmodtager!AF94)","v":0},{"$f":"IF(Lønmodtager!A94=\"ÅÅÅ\",0,Lønmodtager!AN94)","v":0},{"$f":"C100-D100","v":0}]
[{"$f":"IF(Lønmodtager!A95=\"ÅÅÅ\",\"\",Lønmodtager!A95&REPT(\".\",200))","v":""},{"$f":"IF(Lønmodtager!A95=\"ÅÅÅ\",\"\",Lønmodtager!H95)","v":""},{"$f":"IF(Lønmodtager!A95=\"ÅÅÅ\",0,Lønmodtager!AF95)","v":0},{"$f":"IF(Lønmodtager!A95=\"ÅÅÅ\",0,Lønmodtager!AN95)","v":0},{"$f":"C101-D101","v":0}]
[{"$f":"IF(Lønmodtager!A96=\"ÅÅÅ\",\"\",Lønmodtager!A96&REPT(\".\",200))","v":""},{"$f":"IF(Lønmodtager!A96=\"ÅÅÅ\",\"\",Lønmodtager!H96)","v":""},{"$f":"IF(Lønmodtager!A96=\"ÅÅÅ\",0,Lønmodtager!AF96)","v":0},{"$f":"IF(Lønmodtager!A96=\"ÅÅÅ\",0,Lønmodtager!AN96)","v":0},{"$f":"C102-D102","v":0}]
[{"$f":"IF(Lønmodtager!A97=\"ÅÅÅ\",\"\",Lønmodtager!A97&REPT(\".\",200))","v":""},{"$f":"IF(Lønmodtager!A97=\"ÅÅÅ\",\"\",Lønmodtager!H97)","v":""},{"$f":"IF(Lønmodtager!A97=\"ÅÅÅ\",0,Lønmodtager!AF97)","v":0},{"$f":"IF(Lønmodtager!A97=\"ÅÅÅ\",0,Lønmodtager!AN97)","v":0},{"$f":"C103-D103","v":0}]
[{"$f":"IF(Lønmodtager!A98=\"ÅÅÅ\",\"\",Lønmodtager!A98&REPT(\".\",200))","v":""},{"$f":"IF(Lønmodtager!A98=\"ÅÅÅ\",\"\",Lønmodtager!H98)","v":""},{"$f":"IF(Lønmodtager!A98=\"ÅÅÅ\",0,Lønmodtager!AF98)","v":0},{"$f":"IF(Lønmodtager!A98=\"ÅÅÅ\",0,Lønmodtager!AN98)","v":0},{"$f":"C104-D104","v":0}]
[{"$f":"IF(Lønmodtager!A99=\"ÅÅÅ\",\"\",Lønmodtager!A99&REPT(\".\",200))","v":""},{"$f":"IF(Lønmodtager!A99=\"ÅÅÅ\",\"\",Lønmodtager!H99)","v":""},{"$f":"IF(Lønmodtager!A99=\"ÅÅÅ\",0,Lønmodtager!AF99)","v":0},{"$f":"IF(Lønmodtager!A99=\"ÅÅÅ\",0,Lønmodtager!AN99)","v":0},{"$f":"C105-D105","v":0}]

{"sheet":"Oplysningssedler","index":8,"n_rows":99,"n_cols":18,"rows_kept":99,"cut":false,"hidden":false,"merged":[]}
[]
[{"$f":"Lønmodtager!A3","v":"         Navn "},{"$f":"Lønmodtager!F3","v":"Adresse"},{"$f":"Lønmodtager!G3","v":"Postnr. Og By"},{"$f":"Lønmodtager!H3","v":"Cpr.nr."},{"$f":"Lønmodtager!Q3","v":"Ansat"},{"$f":"Lønmodtager!R3","v":"Fratrådt"},{"$f":"Lønmodtager!AA3","v":"AM-indk."},{"$f":"MID(Lønmodtager!AB3,1,8)","v":"Dagpenge"},{"$f":"Lønmodtager!AD3","v":"A-skat"},{"$f":"Lønmodtager!AC3","v":"AM-bid."},{"$f":"Lønmodtager!AE3","v":"SP-bid."},{"$f":"Lønmodtager!AF3","v":"Pensionsbid."},{"$f":"MID(Lønmodtager!AG3,1,3)","v":"ATP"},{"$f":"MID(Lønmodtager!AK3,1,10)","v":"Bef.godtg."},{"$f":"MID(Lønmodtager!AP3,1,10)","v":"Rejsegodtg"},{"$f":"MID(Lønmodtager!AO3,1,10)","v":"Timer"},{"$f":"MID(Lønmodtager!AQ3,1,10)","v":"B-Indkomst"},{"$f":"MID(Lønmodtager!AR3,1,10)","v":"Fri Bil ol"}]
[]
[{"$f":"IF(Lønmodtager!$A5<>\"ÅÅÅ\",Lønmodtager!A5,\"\")","v":"Søgenavn indtastes i celle F7"},{"$f":"IF(Lønmodtager!$A5<>\"ÅÅÅ\",Lønmodtager!F5,\"\")","v":"Lønm.adr Mangler i Fanebladet Lønmodtager"},{"$f":"IF(Lønmodtager!$A5<>\"ÅÅÅ\",Lønmodtager!G5,\"\")","v":"Lønm. Postnr.&By mangler i Fanebladet Lønmodtager"},{"$f":"IF(Lønmodtager!$A5<>\"ÅÅÅ\",Lønmodtager!H5,\"\")","v":"000000-0000"},{"$f":"IF(Lønmodtager!$A5<>\"ÅÅÅ\",Lønmodtager!Q5,\"\")","v":"2007-01-01"},{"$f":"IF(Lønmodtager!$A5<>\"ÅÅÅ\",Lønmodtager!R5,\"\")","v":"00:00:00"},{"$f":"IF(Lønmodtager!$A5<>\"ÅÅÅ\",Lønmodtager!AA5,\"\")","v":0},{"$f":"IF(Lønmodtager!$A5<>\"ÅÅÅ\",Lønmodtager!AB5,\"\")","v":0},{"$f":"IF(Lønmodtager!$A5<>\"ÅÅÅ\",Lønmodtager!AD5,\"\")","v":0},{"$f":"IF(Lønmodtager!$A5<>\"ÅÅÅ\",Lønmodtager!AC5,\"\")","v":0},{"$f":"IF(Lønmodtager!$A5<>\"ÅÅÅ\",Lønmodtager!AE5,\"\")","v":0},{"$f":"IF(Lønmodtager!$A5<>\"ÅÅÅ\",Lønmodtager!AF5,\"\")","v":0},{"$f":"IF(Lønmodtager!$A5<>\"ÅÅÅ\",Lønmodtager!AG5,\"\")","v":0},{"$f":"IF(Lønmodtager!$A5<>\"ÅÅÅ\",Lønmodtager!AK5,\"\")","v":0},{"$f":"IF(Lønmodtager!$A5<>\"ÅÅÅ\",Lønmodtager!AP5,\"\")","v":0},{"$f":"IF(Lønmodtager!$A5<>\"ÅÅÅ\",Lønmodtager!AO5,\"\")","v":0},{"$f":"IF(Lønmodtager!$A5<>\"ÅÅÅ\",Lønmodtager!AQ5,\"\")","v":0},{"$f":"IF(Lønmodtager!$A5<>\"ÅÅÅ\",Lønmodtager!AR5,\"\")","v":0}]
[{"$f":"IF(Lønmodtager!$A6<>\"ÅÅÅ\",Lønmodtager!A6,\"\")","v":"Testperson"},{"$f":"IF(Lønmodtager!$A6<>\"ÅÅÅ\",Lønmodtager!F6,\"\")","v":"Lønm.adr Mangler i Fanebladet Lønmodtager"},{"$f":"IF(Lønmodtager!$A6<>\"ÅÅÅ\",Lønmodtager!G6,\"\")","v":"Lønm. Postnr.&By mangler i Fanebladet Lønmodtager"},{"$f":"IF(Lønmodtager!$A6<>\"ÅÅÅ\",Lønmodtager!H6,\"\")","v":"12345678-1234"},{"$f":"IF(Lønmodtager!$A6<>\"ÅÅÅ\",Lønmodtager!Q6,\"\")","v":"2007-01-01"},{"$f":"IF(Lønmodtager!$A6<>\"ÅÅÅ\",Lønmodtager!R6,\"\")","v":"00:00:00"},{"$f":"IF(Lønmodtager!$A6<>\"ÅÅÅ\",Lønmodtager!AA6,\"\")","v":0},{"$f":"IF(Lønmodtager!$A6<>\"ÅÅÅ\",Lønmodtager!AB6,\"\")","v":0},{"$f":"IF(Lønmodtager!$A6<>\"ÅÅÅ\",Lønmodtager!AD6,\"\")","v":0},{"$f":"IF(Lønmodtager!$A6<>\"ÅÅÅ\",Lønmodtager!AC6,\"\")","v":0},{"$f":"IF(Lønmodtager!$A6<>\"ÅÅÅ\",Lønmodtager!AE6,\"\")","v":0},{"$f":"IF(Lønmodtager!$A6<>\"ÅÅÅ\",Lønmodtager!AF6,\"\")","v":0},{"$f":"IF(Lønmodtager!$A6<>\"ÅÅÅ\",Lønmodtager!AG6,\"\")","v":0},{"$f":"IF(Lønmodtager!$A6<>\"ÅÅÅ\",Lønmodtager!AK6,\"\")","v":0},{"$f":"IF(Lønmodtager!$A6<>\"ÅÅÅ\",Lønmodtager!AP6,\"\")","v":0},{"$f":"IF(Lønmodtager!$A6<>\"ÅÅÅ\",Lønmodtager!AO6,\"\")","v":0},{"$f":"IF(Lønmodtager!$A6<>\"ÅÅÅ\",Lønmodtager!AQ6,\"\")","v":0},{"$f":"IF(Lønmodtager!$A6<>\"ÅÅÅ\",Lønmodtager!AR6,\"\")","v":0}]
[{"$f":"IF(Lønmodtager!$A7<>\"ÅÅÅ\",Lønmodtager!A7,\"\")","v":""},{"$f":"IF(Lønmodtager!$A7<>\"ÅÅÅ\",Lønmodtager!F7,\"\")","v":""},{"$f":"IF(Lønmodtager!$A7<>\"ÅÅÅ\",Lønmodtager!G7,\"\")","v":""},{"$f":"IF(Lønmodtager!$A7<>\"ÅÅÅ\",Lønmodtager!H7,\"\")","v":""},{"$f":"IF(Lønmodtager!$A7<>\"ÅÅÅ\",Lønmodtager!Q7,\"\")","v":""},{"$f":"IF(Lønmodtager!$A7<>\"ÅÅÅ\",Lønmodtager!R7,\"\")","v":""},{"$f":"IF(Lønmodtager!$A7<>\"ÅÅÅ\",Lønmodtager!AA7,\"\")","v":""},{"$f":"IF(Lønmodtager!$A7<>\"ÅÅÅ\",Lønmodtager!AB7,\"\")","v":""},{"$f":"IF(Lønmodtager!$A7<>\"ÅÅÅ\",Lønmodtager!AD7,\"\")","v":""},{"$f":"IF(Lønmodtager!$A7<>\"ÅÅÅ\",Lønmodtager!AC7,\"\")","v":""},{"$f":"IF(Lønmodtager!$A7<>\"ÅÅÅ\",Lønmodtager!AE7,\"\")","v":""},{"$f":"IF(Lønmodtager!$A7<>\"ÅÅÅ\",Lønmodtager!AF7,\"\")","v":""},{"$f":"IF(Lønmodtager!$A7<>\"ÅÅÅ\",Lønmodtager!AG7,\"\")","v":""},{"$f":"IF(Lønmodtager!$A7<>\"ÅÅÅ\",Lønmodtager!AK7,\"\")","v":""},{"$f":"IF(Lønmodtager!$A7<>\"ÅÅÅ\",Lønmodtager!AP7,\"\")","v":""},{"$f":"IF(Lønmodtager!$A7<>\"ÅÅÅ\",Lønmodtager!AO7,\"\")","v":""},{"$f":"IF(Lønmodtager!$A7<>\"ÅÅÅ\",Lønmodtager!AQ7,\"\")","v":""},{"$f":"IF(Lønmodtager!$A7<>\"ÅÅÅ\",Lønmodtager!AR7,\"\")","v":""}]
[{"$f":"IF(Lønmodtager!$A8<>\"ÅÅÅ\",Lønmodtager!A8,\"\")","v":""},{"$f":"IF(Lønmodtager!$A8<>\"ÅÅÅ\",Lønmodtager!F8,\"\")","v":""},{"$f":"IF(Lønmodtager!$A8<>\"ÅÅÅ\",Lønmodtager!G8,\"\")","v":""},{"$f":"IF(Lønmodtager!$A8<>\"ÅÅÅ\",Lønmodtager!H8,\"\")","v":""},{"$f":"IF(Lønmodtager!$A8<>\"ÅÅÅ\",Lønmodtager!Q8,\"\")","v":""},{"$f":"IF(Lønmodtager!$A8<>\"ÅÅÅ\",Lønmodtager!R8,\"\")","v":""},{"$f":"IF(Lønmodtager!$A8<>\"ÅÅÅ\",Lønmodtager!AA8,\"\")","v":""},{"$f":"IF(Lønmodtager!$A8<>\"ÅÅÅ\",Lønmodtager!AB8,\"\")","v":""},{"$f":"IF(Lønmodtager!$A8<>\"ÅÅÅ\",Lønmodtager!AD8,\"\")","v":""},{"$f":"IF(Lønmodtager!$A8<>\"ÅÅÅ\",Lønmodtager!AC8,\"\")","v":""},{"$f":"IF(Lønmodtager!$A8<>\"ÅÅÅ\",Lønmodtager!AE8,\"\")","v":""},{"$f":"IF(Lønmodtager!$A8<>\"ÅÅÅ\",Lønmodtager!AF8,\"\")","v":""},{"$f":"IF(Lønmodtager!$A8<>\"ÅÅÅ\",Lønmodtager!AG8,\"\")","v":""},{"$f":"IF(Lønmodtager!$A8<>\"ÅÅÅ\",Lønmodtager!AK8,\"\")","v":""},{"$f":"IF(Lønmodtager!$A8<>\"ÅÅÅ\",Lønmodtager!AP8,\"\")","v":""},{"$f":"IF(Lønmodtager!$A8<>\"ÅÅÅ\",Lønmodtager!AO8,\"\")","v":""},{"$f":"IF(Lønmodtager!$A8<>\"ÅÅÅ\",Lønmodtager!AQ8,\"\")","v":""},{"$f":"IF(Lønmodtager!$A8<>\"ÅÅÅ\",Lønmodtager!AR8,\"\")","v":""}]
[{"$f":"IF(Lønmodtager!$A9<>\"ÅÅÅ\",Lønmodtager!A9,\"\")","v":""},{"$f":"IF(Lønmodtager!$A9<>\"ÅÅÅ\",Lønmodtager!F9,\"\")","v":""},{"$f":"IF(Lønmodtager!$A9<>\"ÅÅÅ\",Lønmodtager!G9,\"\")","v":""},{"$f":"IF(Lønmodtager!$A9<>\"ÅÅÅ\",Lønmodtager!H9,\"\")","v":""},{"$f":"IF(Lønmodtager!$A9<>\"ÅÅÅ\",Lønmodtager!Q9,\"\")","v":""},{"$f":"IF(Lønmodtager!$A9<>\"ÅÅÅ\",Lønmodtager!R9,\"\")","v":""},{"$f":"IF(Lønmodtager!$A9<>\"ÅÅÅ\",Lønmodtager!AA9,\"\")","v":""},{"$f":"IF(Lønmodtager!$A9<>\"ÅÅÅ\",Lønmodtager!AB9,\"\")","v":""},{"$f":"IF(Lønmodtager!$A9<>\"ÅÅÅ\",Lønmodtager!AD9,\"\")","v":""},{"$f":"IF(Lønmodtager!$A9<>\"ÅÅÅ\",Lønmodtager!AC9,\"\")","v":""},{"$f":"IF(Lønmodtager!$A9<>\"ÅÅÅ\",Lønmodtager!AE9,\"\")","v":""},{"$f":"IF(Lønmodtager!$A9<>\"ÅÅÅ\",Lønmodtager!AF9,\"\")","v":""},{"$f":"IF(Lønmodtager!$A9<>\"ÅÅÅ\",Lønmodtager!AG9,\"\")","v":""},{"$f":"IF(Lønmodtager!$A9<>\"ÅÅÅ\",Lønmodtager!AK9,\"\")","v":""},{"$f":"IF(Lønmodtager!$A9<>\"ÅÅÅ\",Lønmodtager!AP9,\"\")","v":""},{"$f":"IF(Lønmodtager!$A9<>\"ÅÅÅ\",Lønmodtager!AO9,\"\")","v":""},{"$f":"IF(Lønmodtager!$A9<>\"ÅÅÅ\",Lønmodtager!AQ9,\"\")","v":""},{"$f":"IF(Lønmodtager!$A9<>\"ÅÅÅ\",Lønmodtager!AR9,\"\")","v":""}]
[{"$f":"IF(Lønmodtager!$A10<>\"ÅÅÅ\",Lønmodtager!A10,\"\")","v":""},{"$f":"IF(Lønmodtager!$A10<>\"ÅÅÅ\",Lønmodtager!F10,\"\")","v":""},{"$f":"IF(Lønmodtager!$A10<>\"ÅÅÅ\",Lønmodtager!G10,\"\")","v":""},{"$f":"IF(Lønmodtager!$A10<>\"ÅÅÅ\",Lønmodtager!H10,\"\")","v":""},{"$f":"IF(Lønmodtager!$A10<>\"ÅÅÅ\",Lønmodtager!Q10,\"\")","v":""},{"$f":"IF(Lønmodtager!$A10<>\"ÅÅÅ\",Lønmodtager!R10,\"\")","v":""},{"$f":"IF(Lønmodtager!$A10<>\"ÅÅÅ\",Lønmodtager!AA10,\"\")","v":""},{"$f":"IF(Lønmodtager!$A10<>\"ÅÅÅ\",Lønmodtager!AB10,\"\")","v":""},{"$f":"IF(Lønmodtager!$A10<>\"ÅÅÅ\",Lønmodtager!AD10,\"\")","v":""},{"$f":"IF(Lønmodtager!$A10<>\"ÅÅÅ\",Lønmodtager!AC10,\"\")","v":""},{"$f":"IF(Lønmodtager!$A10<>\"ÅÅÅ\",Lønmodtager!AE10,\"\")","v":""},{"$f":"IF(Lønmodtager!$A10<>\"ÅÅÅ\",Lønmodtager!AF10,\"\")","v":""},{"$f":"IF(Lønmodtager!$A10<>\"ÅÅÅ\",Lønmodtager!AG10,\"\")","v":""},{"$f":"IF(Lønmodtager!$A10<>\"ÅÅÅ\",Lønmodtager!AK10,\"\")","v":""},{"$f":"IF(Lønmodtager!$A10<>\"ÅÅÅ\",Lønmodtager!AP10,\"\")","v":""},{"$f":"IF(Lønmodtager!$A10<>\"ÅÅÅ\",Lønmodtager!AO10,\"\")","v":""},{"$f":"IF(Lønmodtager!$A10<>\"ÅÅÅ\",Lønmodtager!AQ10,\"\")","v":""},{"$f":"IF(Lønmodtager!$A10<>\"ÅÅÅ\",Lønmodtager!AR10,\"\")","v":""}]
[{"$f":"IF(Lønmodtager!$A11<>\"ÅÅÅ\",Lønmodtager!A11,\"\")","v":""},{"$f":"IF(Lønmodtager!$A11<>\"ÅÅÅ\",Lønmodtager!F11,\"\")","v":""},{"$f":"IF(Lønmodtager!$A11<>\"ÅÅÅ\",Lønmodtager!G11,\"\")","v":""},{"$f":"IF(Lønmodtager!$A11<>\"ÅÅÅ\",Lønmodtager!H11,\"\")","v":""},{"$f":"IF(Lønmodtager!$A11<>\"ÅÅÅ\",Lønmodtager!Q11,\"\")","v":""},{"$f":"IF(Lønmodtager!$A11<>\"ÅÅÅ\",Lønmodtager!R11,\"\")","v":""},{"$f":"IF(Lønmodtager!$A11<>\"ÅÅÅ\",Lønmodtager!AA11,\"\")","v":""},{"$f":"IF(Lønmodtager!$A11<>\"ÅÅÅ\",Lønmodtager!AB11,\"\")","v":""},{"$f":"IF(Lønmodtager!$A11<>\"ÅÅÅ\",Lønmodtager!AD11,\"\")","v":""},{"$f":"IF(Lønmodtager!$A11<>\"ÅÅÅ\",Lønmodtager!AC11,\"\")","v":""},{"$f":"IF(Lønmodtager!$A11<>\"ÅÅÅ\",Lønmodtager!AE11,\"\")","v":""},{"$f":"IF(Lønmodtager!$A11<>\"ÅÅÅ\",Lønmodtager!AF11,\"\")","v":""},{"$f":"IF(Lønmodtager!$A11<>\"ÅÅÅ\",Lønmodtager!AG11,\"\")","v":""},{"$f":"IF(Lønmodtager!$A11<>\"ÅÅÅ\",Lønmodtager!AK11,\"\")","v":""},{"$f":"IF(Lønmodtager!$A11<>\"ÅÅÅ\",Lønmodtager!AP11,\"\")","v":""},{"$f":"IF(Lønmodtager!$A11<>\"ÅÅÅ\",Lønmodtager!AO11,\"\")","v":""},{"$f":"IF(Lønmodtager!$A11<>\"ÅÅÅ\",Lønmodtager!AQ11,\"\")","v":""},{"$f":"IF(Lønmodtager!$A11<>\"ÅÅÅ\",Lønmodtager!AR11,\"\")","v":""}]
[{"$f":"IF(Lønmodtager!$A12<>\"ÅÅÅ\",Lønmodtager!A12,\"\")","v":""},{"$f":"IF(Lønmodtager!$A12<>\"ÅÅÅ\",Lønmodtager!F12,\"\")","v":""},{"$f":"IF(Lønmodtager!$A12<>\"ÅÅÅ\",Lønmodtager!G12,\"\")","v":""},{"$f":"IF(Lønmodtager!$A12<>\"ÅÅÅ\",Lønmodtager!H12,\"\")","v":""},{"$f":"IF(Lønmodtager!$A12<>\"ÅÅÅ\",Lønmodtager!Q12,\"\")","v":""},{"$f":"IF(Lønmodtager!$A12<>\"ÅÅÅ\",Lønmodtager!R12,\"\")","v":""},{"$f":"IF(Lønmodtager!$A12<>\"ÅÅÅ\",Lønmodtager!AA12,\"\")","v":""},{"$f":"IF(Lønmodtager!$A12<>\"ÅÅÅ\",Lønmodtager!AB12,\"\")","v":""},{"$f":"IF(Lønmodtager!$A12<>\"ÅÅÅ\",Lønmodtager!AD12,\"\")","v":""},{"$f":"IF(Lønmodtager!$A12<>\"ÅÅÅ\",Lønmodtager!AC12,\"\")","v":""},{"$f":"IF(Lønmodtager!$A12<>\"ÅÅÅ\",Lønmodtager!AE12,\"\")","v":""},{"$f":"IF(Lønmodtager!$A12<>\"ÅÅÅ\",Lønmodtager!AF12,\"\")","v":""},{"$f":"IF(Lønmodtager!$A12<>\"ÅÅÅ\",Lønmodtager!AG12,\"\")","v":""},{"$f":"IF(Lønmodtager!$A12<>\"ÅÅÅ\",Lønmodtager!AK12,\"\")","v":""},{"$f":"IF(Lønmodtager!$A12<>\"ÅÅÅ\",Lønmodtager!AP12,\"\")","v":""},{"$f":"IF(Lønmodtager!$A12<>\"ÅÅÅ\",Lønmodtager!AO12,\"\")","v":""},{"$f":"IF(Lønmodtager!$A12<>\"ÅÅÅ\",Lønmodtager!AQ12,\"\")","v":""},{"$f":"IF(Lønmodtager!$A12<>\"ÅÅÅ\",Lønmodtager!AR12,\"\")","v":""}]
[{"$f":"IF(Lønmodtager!$A13<>\"ÅÅÅ\",Lønmodtager!A13,\"\")","v":""},{"$f":"IF(Lønmodtager!$A13<>\"ÅÅÅ\",Lønmodtager!F13,\"\")","v":""},{"$f":"IF(Lønmodtager!$A13<>\"ÅÅÅ\",Lønmodtager!G13,\"\")","v":""},{"$f":"IF(Lønmodtager!$A13<>\"ÅÅÅ\",Lønmodtager!H13,\"\")","v":""},{"$f":"IF(Lønmodtager!$A13<>\"ÅÅÅ\",Lønmodtager!Q13,\"\")","v":""},{"$f":"IF(Lønmodtager!$A13<>\"ÅÅÅ\",Lønmodtager!R13,\"\")","v":""},{"$f":"IF(Lønmodtager!$A13<>\"ÅÅÅ\",Lønmodtager!AA13,\"\")","v":""},{"$f":"IF(Lønmodtager!$A13<>\"ÅÅÅ\",Lønmodtager!AB13,\"\")","v":""},{"$f":"IF(Lønmodtager!$A13<>\"ÅÅÅ\",Lønmodtager!AD13,\"\")","v":""},{"$f":"IF(Lønmodtager!$A13<>\"ÅÅÅ\",Lønmodtager!AC13,\"\")","v":""},{"$f":"IF(Lønmodtager!$A13<>\"ÅÅÅ\",Lønmodtager!AE13,\"\")","v":""},{"$f":"IF(Lønmodtager!$A13<>\"ÅÅÅ\",Lønmodtager!AF13,\"\")","v":""},{"$f":"IF(Lønmodtager!$A13<>\"ÅÅÅ\",Lønmodtager!AG13,\"\")","v":""},{"$f":"IF(Lønmodtager!$A13<>\"ÅÅÅ\",Lønmodtager!AK13,\"\")","v":""},{"$f":"IF(Lønmodtager!$A13<>\"ÅÅÅ\",Lønmodtager!AP13,\"\")","v":""},{"$f":"IF(Lønmodtager!$A13<>\"ÅÅÅ\",Lønmodtager!AO13,\"\")","v":""},{"$f":"IF(Lønmodtager!$A13<>\"ÅÅÅ\",Lønmodtager!AQ13,\"\")","v":""},{"$f":"IF(Lønmodtager!$A13<>\"ÅÅÅ\",Lønmodtager!AR13,\"\")","v":""}]
[{"$f":"IF(Lønmodtager!$A14<>\"ÅÅÅ\",Lønmodtager!A14,\"\")","v":""},{"$f":"IF(Lønmodtager!$A14<>\"ÅÅÅ\",Lønmodtager!F14,\"\")","v":""},{"$f":"IF(Lønmodtager!$A14<>\"ÅÅÅ\",Lønmodtager!G14,\"\")","v":""},{"$f":"IF(Lønmodtager!$A14<>\"ÅÅÅ\",Lønmodtager!H14,\"\")","v":""},{"$f":"IF(Lønmodtager!$A14<>\"ÅÅÅ\",Lønmodtager!Q14,\"\")","v":""},{"$f":"IF(Lønmodtager!$A14<>\"ÅÅÅ\",Lønmodtager!R14,\"\")","v":""},{"$f":"IF(Lønmodtager!$A14<>\"ÅÅÅ\",Lønmodtager!AA14,\"\")","v":""},{"$f":"IF(Lønmodtager!$A14<>\"ÅÅÅ\",Lønmodtager!AB14,\"\")","v":""},{"$f":"IF(Lønmodtager!$A14<>\"ÅÅÅ\",Lønmodtager!AD14,\"\")","v":""},{"$f":"IF(Lønmodtager!$A14<>\"ÅÅÅ\",Lønmodtager!AC14,\"\")","v":""},{"$f":"IF(Lønmodtager!$A14<>\"ÅÅÅ\",Lønmodtager!AE14,\"\")","v":""},{"$f":"IF(Lønmodtager!$A14<>\"ÅÅÅ\",Lønmodtager!AF14,\"\")","v":""},{"$f":"IF(Lønmodtager!$A14<>\"ÅÅÅ\",Lønmodtager!AG14,\"\")","v":""},{"$f":"IF(Lønmodtager!$A14<>\"ÅÅÅ\",Lønmodtager!AK14,\"\")","v":""},{"$f":"IF(Lønmodtager!$A14<>\"ÅÅÅ\",Lønmodtager!AP14,\"\")","v":""},{"$f":"IF(Lønmodtager!$A14<>\"ÅÅÅ\",Lønmodtager!AO14,\"\")","v":""},{"$f":"IF(Lønmodtager!$A14<>\"ÅÅÅ\",Lønmodtager!AQ14,\"\")","v":""},{"$f":"IF(Lønmodtager!$A14<>\"ÅÅÅ\",Lønmodtager!AR14,\"\")","v":""}]
[{"$f":"IF(Lønmodtager!$A15<>\"ÅÅÅ\",Lønmodtager!A15,\"\")","v":""},{"$f":"IF(Lønmodtager!$A15<>\"ÅÅÅ\",Lønmodtager!F15,\"\")","v":""},{"$f":"IF(Lønmodtager!$A15<>\"ÅÅÅ\",Lønmodtager!G15,\"\")","v":""},{"$f":"IF(Lønmodtager!$A15<>\"ÅÅÅ\",Lønmodtager!H15,\"\")","v":""},{"$f":"IF(Lønmodtager!$A15<>\"ÅÅÅ\",Lønmodtager!Q15,\"\")","v":""},{"$f":"IF(Lønmodtager!$A15<>\"ÅÅÅ\",Lønmodtager!R15,\"\")","v":""},{"$f":"IF(Lønmodtager!$A15<>\"ÅÅÅ\",Lønmodtager!AA15,\"\")","v":""},{"$f":"IF(Lønmodtager!$A15<>\"ÅÅÅ\",Lønmodtager!AB15,\"\")","v":""},{"$f":"IF(Lønmodtager!$A15<>\"ÅÅÅ\",Lønmodtager!AD15,\"\")","v":""},{"$f":"IF(Lønmodtager!$A15<>\"ÅÅÅ\",Lønmodtager!AC15,\"\")","v":""},{"$f":"IF(Lønmodtager!$A15<>\"ÅÅÅ\",Lønmodtager!AE15,\"\")","v":""},{"$f":"IF(Lønmodtager!$A15<>\"ÅÅÅ\",Lønmodtager!AF15,\"\")","v":""},{"$f":"IF(Lønmodtager!$A15<>\"ÅÅÅ\",Lønmodtager!AG15,\"\")","v":""},{"$f":"IF(Lønmodtager!$A15<>\"ÅÅÅ\",Lønmodtager!AK15,\"\")","v":""},{"$f":"IF(Lønmodtager!$A15<>\"ÅÅÅ\",Lønmodtager!AP15,\"\")","v":""},{"$f":"IF(Lønmodtager!$A15<>\"ÅÅÅ\",Lønmodtager!AO15,\"\")","v":""},{"$f":"IF(Lønmodtager!$A15<>\"ÅÅÅ\",Lønmodtager!AQ15,\"\")","v":""},{"$f":"IF(Lønmodtager!$A15<>\"ÅÅÅ\",Lønmodtager!AR15,\"\")","v":""}]
[{"$f":"IF(Lønmodtager!$A16<>\"ÅÅÅ\",Lønmodtager!A16,\"\")","v":""},{"$f":"IF(Lønmodtager!$A16<>\"ÅÅÅ\",Lønmodtager!F16,\"\")","v":""},{"$f":"IF(Lønmodtager!$A16<>\"ÅÅÅ\",Lønmodtager!G16,\"\")","v":""},{"$f":"IF(Lønmodtager!$A16<>\"ÅÅÅ\",Lønmodtager!H16,\"\")","v":""},{"$f":"IF(Lønmodtager!$A16<>\"ÅÅÅ\",Lønmodtager!Q16,\"\")","v":""},{"$f":"IF(Lønmodtager!$A16<>\"ÅÅÅ\",Lønmodtager!R16,\"\")","v":""},{"$f":"IF(Lønmodtager!$A16<>\"ÅÅÅ\",Lønmodtager!AA16,\"\")","v":""},{"$f":"IF(Lønmodtager!$A16<>\"ÅÅÅ\",Lønmodtager!AB16,\"\")","v":""},{"$f":"IF(Lønmodtager!$A16<>\"ÅÅÅ\",Lønmodtager!AD16,\"\")","v":""},{"$f":"IF(Lønmodtager!$A16<>\"ÅÅÅ\",Lønmodtager!AC16,\"\")","v":""},{"$f":"IF(Lønmodtager!$A16<>\"ÅÅÅ\",Lønmodtager!AE16,\"\")","v":""},{"$f":"IF(Lønmodtager!$A16<>\"ÅÅÅ\",Lønmodtager!AF16,\"\")","v":""},{"$f":"IF(Lønmodtager!$A16<>\"ÅÅÅ\",Lønmodtager!AG16,\"\")","v":""},{"$f":"IF(Lønmodtager!$A16<>\"ÅÅÅ\",Lønmodtager!AK16,\"\")","v":""},{"$f":"IF(Lønmodtager!$A16<>\"ÅÅÅ\",Lønmodtager!AP16,\"\")","v":""},{"$f":"IF(Lønmodtager!$A16<>\"ÅÅÅ\",Lønmodtager!AO16,\"\")","v":""},{"$f":"IF(Lønmodtager!$A16<>\"ÅÅÅ\",Lønmodtager!AQ16,\"\")","v":""},{"$f":"IF(Lønmodtager!$A16<>\"ÅÅÅ\",Lønmodtager!AR16,\"\")","v":""}]
[{"$f":"IF(Lønmodtager!$A17<>\"ÅÅÅ\",Lønmodtager!A17,\"\")","v":""},{"$f":"IF(Lønmodtager!$A17<>\"ÅÅÅ\",Lønmodtager!F17,\"\")","v":""},{"$f":"IF(Lønmodtager!$A17<>\"ÅÅÅ\",Lønmodtager!G17,\"\")","v":""},{"$f":"IF(Lønmodtager!$A17<>\"ÅÅÅ\",Lønmodtager!H17,\"\")","v":""},{"$f":"IF(Lønmodtager!$A17<>\"ÅÅÅ\",Lønmodtager!Q17,\"\")","v":""},{"$f":"IF(Lønmodtager!$A17<>\"ÅÅÅ\",Lønmodtager!R17,\"\")","v":""},{"$f":"IF(Lønmodtager!$A17<>\"ÅÅÅ\",Lønmodtager!AA17,\"\")","v":""},{"$f":"IF(Lønmodtager!$A17<>\"ÅÅÅ\",Lønmodtager!AB17,\"\")","v":""},{"$f":"IF(Lønmodtager!$A17<>\"ÅÅÅ\",Lønmodtager!AD17,\"\")","v":""},{"$f":"IF(Lønmodtager!$A17<>\"ÅÅÅ\",Lønmodtager!AC17,\"\")","v":""},{"$f":"IF(Lønmodtager!$A17<>\"ÅÅÅ\",Lønmodtager!AE17,\"\")","v":""},{"$f":"IF(Lønmodtager!$A17<>\"ÅÅÅ\",Lønmodtager!AF17,\"\")","v":""},{"$f":"IF(Lønmodtager!$A17<>\"ÅÅÅ\",Lønmodtager!AG17,\"\")","v":""},{"$f":"IF(Lønmodtager!$A17<>\"ÅÅÅ\",Lønmodtager!AK17,\"\")","v":""},{"$f":"IF(Lønmodtager!$A17<>\"ÅÅÅ\",Lønmodtager!AP17,\"\")","v":""},{"$f":"IF(Lønmodtager!$A17<>\"ÅÅÅ\",Lønmodtager!AO17,\"\")","v":""},{"$f":"IF(Lønmodtager!$A17<>\"ÅÅÅ\",Lønmodtager!AQ17,\"\")","v":""},{"$f":"IF(Lønmodtager!$A17<>\"ÅÅÅ\",Lønmodtager!AR17,\"\")","v":""}]
[{"$f":"IF(Lønmodtager!$A18<>\"ÅÅÅ\",Lønmodtager!A18,\"\")","v":""},{"$f":"IF(Lønmodtager!$A18<>\"ÅÅÅ\",Lønmodtager!F18,\"\")","v":""},{"$f":"IF(Lønmodtager!$A18<>\"ÅÅÅ\",Lønmodtager!G18,\"\")","v":""},{"$f":"IF(Lønmodtager!$A18<>\"ÅÅÅ\",Lønmodtager!H18,\"\")","v":""},{"$f":"IF(Lønmodtager!$A18<>\"ÅÅÅ\",Lønmodtager!Q18,\"\")","v":""},{"$f":"IF(Lønmodtager!$A18<>\"ÅÅÅ\",Lønmodtager!R18,\"\")","v":""},{"$f":"IF(Lønmodtager!$A18<>\"ÅÅÅ\",Lønmodtager!AA18,\"\")","v":""},{"$f":"IF(Lønmodtager!$A18<>\"ÅÅÅ\",Lønmodtager!AB18,\"\")","v":""},{"$f":"IF(Lønmodtager!$A18<>\"ÅÅÅ\",Lønmodtager!AD18,\"\")","v":""},{"$f":"IF(Lønmodtager!$A18<>\"ÅÅÅ\",Lønmodtager!AC18,\"\")","v":""},{"$f":"IF(Lønmodtager!$A18<>\"ÅÅÅ\",Lønmodtager!AE18,\"\")","v":""},{"$f":"IF(Lønmodtager!$A18<>\"ÅÅÅ\",Lønmodtager!AF18,\"\")","v":""},{"$f":"IF(Lønmodtager!$A18<>\"ÅÅÅ\",Lønmodtager!AG18,\"\")","v":""},{"$f":"IF(Lønmodtager!$A18<>\"ÅÅÅ\",Lønmodtager!AK18,\"\")","v":""},{"$f":"IF(Lønmodtager!$A18<>\"ÅÅÅ\",Lønmodtager!AP18,\"\")","v":""},{"$f":"IF(Lønmodtager!$A18<>\"ÅÅÅ\",Lønmodtager!AO18,\"\")","v":""},{"$f":"IF(Lønmodtager!$A18<>\"ÅÅÅ\",Lønmodtager!AQ18,\"\")","v":""},{"$f":"IF(Lønmodtager!$A18<>\"ÅÅÅ\",Lønmodtager!AR18,\"\")","v":""}]
[{"$f":"IF(Lønmodtager!$A19<>\"ÅÅÅ\",Lønmodtager!A19,\"\")","v":""},{"$f":"IF(Lønmodtager!$A19<>\"ÅÅÅ\",Lønmodtager!F19,\"\")","v":""},{"$f":"IF(Lønmodtager!$A19<>\"ÅÅÅ\",Lønmodtager!G19,\"\")","v":""},{"$f":"IF(Lønmodtager!$A19<>\"ÅÅÅ\",Lønmodtager!H19,\"\")","v":""},{"$f":"IF(Lønmodtager!$A19<>\"ÅÅÅ\",Lønmodtager!Q19,\"\")","v":""},{"$f":"IF(Lønmodtager!$A19<>\"ÅÅÅ\",Lønmodtager!R19,\"\")","v":""},{"$f":"IF(Lønmodtager!$A19<>\"ÅÅÅ\",Lønmodtager!AA19,\"\")","v":""},{"$f":"IF(Lønmodtager!$A19<>\"ÅÅÅ\",Lønmodtager!AB19,\"\")","v":""},{"$f":"IF(Lønmodtager!$A19<>\"ÅÅÅ\",Lønmodtager!AD19,\"\")","v":""},{"$f":"IF(Lønmodtager!$A19<>\"ÅÅÅ\",Lønmodtager!AC19,\"\")","v":""},{"$f":"IF(Lønmodtager!$A19<>\"ÅÅÅ\",Lønmodtager!AE19,\"\")","v":""},{"$f":"IF(Lønmodtager!$A19<>\"ÅÅÅ\",Lønmodtager!AF19,\"\")","v":""},{"$f":"IF(Lønmodtager!$A19<>\"ÅÅÅ\",Lønmodtager!AG19,\"\")","v":""},{"$f":"IF(Lønmodtager!$A19<>\"ÅÅÅ\",Lønmodtager!AK19,\"\")","v":""},{"$f":"IF(Lønmodtager!$A19<>\"ÅÅÅ\",Lønmodtager!AP19,\"\")","v":""},{"$f":"IF(Lønmodtager!$A19<>\"ÅÅÅ\",Lønmodtager!AO19,\"\")","v":""},{"$f":"IF(Lønmodtager!$A19<>\"ÅÅÅ\",Lønmodtager!AQ19,\"\")","v":""},{"$f":"IF(Lønmodtager!$A19<>\"ÅÅÅ\",Lønmodtager!AR19,\"\")","v":""}]
[{"$f":"IF(Lønmodtager!$A20<>\"ÅÅÅ\",Lønmodtager!A20,\"\")","v":""},{"$f":"IF(Lønmodtager!$A20<>\"ÅÅÅ\",Lønmodtager!F20,\"\")","v":""},{"$f":"IF(Lønmodtager!$A20<>\"ÅÅÅ\",Lønmodtager!G20,\"\")","v":""},{"$f":"IF(Lønmodtager!$A20<>\"ÅÅÅ\",Lønmodtager!H20,\"\")","v":""},{"$f":"IF(Lønmodtager!$A20<>\"ÅÅÅ\",Lønmodtager!Q20,\"\")","v":""},{"$f":"IF(Lønmodtager!$A20<>\"ÅÅÅ\",Lønmodtager!R20,\"\")","v":""},{"$f":"IF(Lønmodtager!$A20<>\"ÅÅÅ\",Lønmodtager!AA20,\"\")","v":""},{"$f":"IF(Lønmodtager!$A20<>\"ÅÅÅ\",Lønmodtager!AB20,\"\")","v":""},{"$f":"IF(Lønmodtager!$A20<>\"ÅÅÅ\",Lønmodtager!AD20,\"\")","v":""},{"$f":"IF(Lønmodtager!$A20<>\"ÅÅÅ\",Lønmodtager!AC20,\"\")","v":""},{"$f":"IF(Lønmodtager!$A20<>\"ÅÅÅ\",Lønmodtager!AE20,\"\")","v":""},{"$f":"IF(Lønmodtager!$A20<>\"ÅÅÅ\",Lønmodtager!AF20,\"\")","v":""},{"$f":"IF(Lønmodtager!$A20<>\"ÅÅÅ\",Lønmodtager!AG20,\"\")","v":""},{"$f":"IF(Lønmodtager!$A20<>\"ÅÅÅ\",Lønmodtager!AK20,\"\")","v":""},{"$f":"IF(Lønmodtager!$A20<>\"ÅÅÅ\",Lønmodtager!AP20,\"\")","v":""},{"$f":"IF(Lønmodtager!$A20<>\"ÅÅÅ\",Lønmodtager!AO20,\"\")","v":""},{"$f":"IF(Lønmodtager!$A20<>\"ÅÅÅ\",Lønmodtager!AQ20,\"\")","v":""},{"$f":"IF(Lønmodtager!$A20<>\"ÅÅÅ\",Lønmodtager!AR20,\"\")","v":""}]
[{"$f":"IF(Lønmodtager!$A21<>\"ÅÅÅ\",Lønmodtager!A21,\"\")","v":""},{"$f":"IF(Lønmodtager!$A21<>\"ÅÅÅ\",Lønmodtager!F21,\"\")","v":""},{"$f":"IF(Lønmodtager!$A21<>\"ÅÅÅ\",Lønmodtager!G21,\"\")","v":""},{"$f":"IF(Lønmodtager!$A21<>\"ÅÅÅ\",Lønmodtager!H21,\"\")","v":""},{"$f":"IF(Lønmodtager!$A21<>\"ÅÅÅ\",Lønmodtager!Q21,\"\")","v":""},{"$f":"IF(Lønmodtager!$A21<>\"ÅÅÅ\",Lønmodtager!R21,\"\")","v":""},{"$f":"IF(Lønmodtager!$A21<>\"ÅÅÅ\",Lønmodtager!AA21,\"\")","v":""},{"$f":"IF(Lønmodtager!$A21<>\"ÅÅÅ\",Lønmodtager!AB21,\"\")","v":""},{"$f":"IF(Lønmodtager!$A21<>\"ÅÅÅ\",Lønmodtager!AD21,\"\")","v":""},{"$f":"IF(Lønmodtager!$A21<>\"ÅÅÅ\",Lønmodtager!AC21,\"\")","v":""},{"$f":"IF(Lønmodtager!$A21<>\"ÅÅÅ\",Lønmodtager!AE21,\"\")","v":""},{"$f":"IF(Lønmodtager!$A21<>\"ÅÅÅ\",Lønmodtager!AF21,\"\")","v":""},{"$f":"IF(Lønmodtager!$A21<>\"ÅÅÅ\",Lønmodtager!AG21,\"\")","v":""},{"$f":"IF(Lønmodtager!$A21<>\"ÅÅÅ\",Lønmodtager!AK21,\"\")","v":""},{"$f":"IF(Lønmodtager!$A21<>\"ÅÅÅ\",Lønmodtager!AP21,\"\")","v":""},{"$f":"IF(Lønmodtager!$A21<>\"ÅÅÅ\",Lønmodtager!AO21,\"\")","v":""},{"$f":"IF(Lønmodtager!$A21<>\"ÅÅÅ\",Lønmodtager!AQ21,\"\")","v":""},{"$f":"IF(Lønmodtager!$A21<>\"ÅÅÅ\",Lønmodtager!AR21,\"\")","v":""}]
[{"$f":"IF(Lønmodtager!$A22<>\"ÅÅÅ\",Lønmodtager!A22,\"\")","v":""},{"$f":"IF(Lønmodtager!$A22<>\"ÅÅÅ\",Lønmodtager!F22,\"\")","v":""},{"$f":"IF(Lønmodtager!$A22<>\"ÅÅÅ\",Lønmodtager!G22,\"\")","v":""},{"$f":"IF(Lønmodtager!$A22<>\"ÅÅÅ\",Lønmodtager!H22,\"\")","v":""},{"$f":"IF(Lønmodtager!$A22<>\"ÅÅÅ\",Lønmodtager!Q22,\"\")","v":""},{"$f":"IF(Lønmodtager!$A22<>\"ÅÅÅ\",Lønmodtager!R22,\"\")","v":""},{"$f":"IF(Lønmodtager!$A22<>\"ÅÅÅ\",Lønmodtager!AA22,\"\")","v":""},{"$f":"IF(Lønmodtager!$A22<>\"ÅÅÅ\",Lønmodtager!AB22,\"\")","v":""},{"$f":"IF(Lønmodtager!$A22<>\"ÅÅÅ\",Lønmodtager!AD22,\"\")","v":""},{"$f":"IF(Lønmodtager!$A22<>\"ÅÅÅ\",Lønmodtager!AC22,\"\")","v":""},{"$f":"IF(Lønmodtager!$A22<>\"ÅÅÅ\",Lønmodtager!AE22,\"\")","v":""},{"$f":"IF(Lønmodtager!$A22<>\"ÅÅÅ\",Lønmodtager!AF22,\"\")","v":""},{"$f":"IF(Lønmodtager!$A22<>\"ÅÅÅ\",Lønmodtager!AG22,\"\")","v":""},{"$f":"IF(Lønmodtager!$A22<>\"ÅÅÅ\",Lønmodtager!AK22,\"\")","v":""},{"$f":"IF(Lønmodtager!$A22<>\"ÅÅÅ\",Lønmodtager!AP22,\"\")","v":""},{"$f":"IF(Lønmodtager!$A22<>\"ÅÅÅ\",Lønmodtager!AO22,\"\")","v":""},{"$f":"IF(Lønmodtager!$A22<>\"ÅÅÅ\",Lønmodtager!AQ22,\"\")","v":""},{"$f":"IF(Lønmodtager!$A22<>\"ÅÅÅ\",Lønmodtager!AR22,\"\")","v":""}]
[{"$f":"IF(Lønmodtager!$A23<>\"ÅÅÅ\",Lønmodtager!A23,\"\")","v":""},{"$f":"IF(Lønmodtager!$A23<>\"ÅÅÅ\",Lønmodtager!F23,\"\")","v":""},{"$f":"IF(Lønmodtager!$A23<>\"ÅÅÅ\",Lønmodtager!G23,\"\")","v":""},{"$f":"IF(Lønmodtager!$A23<>\"ÅÅÅ\",Lønmodtager!H23,\"\")","v":""},{"$f":"IF(Lønmodtager!$A23<>\"ÅÅÅ\",Lønmodtager!Q23,\"\")","v":""},{"$f":"IF(Lønmodtager!$A23<>\"ÅÅÅ\",Lønmodtager!R23,\"\")","v":""},{"$f":"IF(Lønmodtager!$A23<>\"ÅÅÅ\",Lønmodtager!AA23,\"\")","v":""},{"$f":"IF(Lønmodtager!$A23<>\"ÅÅÅ\",Lønmodtager!AB23,\"\")","v":""},{"$f":"IF(Lønmodtager!$A23<>\"ÅÅÅ\",Lønmodtager!AD23,\"\")","v":""},{"$f":"IF(Lønmodtager!$A23<>\"ÅÅÅ\",Lønmodtager!AC23,\"\")","v":""},{"$f":"IF(Lønmodtager!$A23<>\"ÅÅÅ\",Lønmodtager!AE23,\"\")","v":""},{"$f":"IF(Lønmodtager!$A23<>\"ÅÅÅ\",Lønmodtager!AF23,\"\")","v":""},{"$f":"IF(Lønmodtager!$A23<>\"ÅÅÅ\",Lønmodtager!AG23,\"\")","v":""},{"$f":"IF(Lønmodtager!$A23<>\"ÅÅÅ\",Lønmodtager!AK23,\"\")","v":""},{"$f":"IF(Lønmodtager!$A23<>\"ÅÅÅ\",Lønmodtager!AP23,\"\")","v":""},{"$f":"IF(Lønmodtager!$A23<>\"ÅÅÅ\",Lønmodtager!AO23,\"\")","v":""},{"$f":"IF(Lønmodtager!$A23<>\"ÅÅÅ\",Lønmodtager!AQ23,\"\")","v":""},{"$f":"IF(Lønmodtager!$A23<>\"ÅÅÅ\",Lønmodtager!AR23,\"\")","v":""}]
[{"$f":"IF(Lønmodtager!$A24<>\"ÅÅÅ\",Lønmodtager!A24,\"\")","v":""},{"$f":"IF(Lønmodtager!$A24<>\"ÅÅÅ\",Lønmodtager!F24,\"\")","v":""},{"$f":"IF(Lønmodtager!$A24<>\"ÅÅÅ\",Lønmodtager!G24,\"\")","v":""},{"$f":"IF(Lønmodtager!$A24<>\"ÅÅÅ\",Lønmodtager!H24,\"\")","v":""},{"$f":"IF(Lønmodtager!$A24<>\"ÅÅÅ\",Lønmodtager!Q24,\"\")","v":""},{"$f":"IF(Lønmodtager!$A24<>\"ÅÅÅ\",Lønmodtager!R24,\"\")","v":""},{"$f":"IF(Lønmodtager!$A24<>\"ÅÅÅ\",Lønmodtager!AA24,\"\")","v":""},{"$f":"IF(Lønmodtager!$A24<>\"ÅÅÅ\",Lønmodtager!AB24,\"\")","v":""},{"$f":"IF(Lønmodtager!$A24<>\"ÅÅÅ\",Lønmodtager!AD24,\"\")","v":""},{"$f":"IF(Lønmodtager!$A24<>\"ÅÅÅ\",Lønmodtager!AC24,\"\")","v":""},{"$f":"IF(Lønmodtager!$A24<>\"ÅÅÅ\",Lønmodtager!AE24,\"\")","v":""},{"$f":"IF(Lønmodtager!$A24<>\"ÅÅÅ\",Lønmodtager!AF24,\"\")","v":""},{"$f":"IF(Lønmodtager!$A24<>\"ÅÅÅ\",Lønmodtager!AG24,\"\")","v":""},{"$f":"IF(Lønmodtager!$A24<>\"ÅÅÅ\",Lønmodtager!AK24,\"\")","v":""},{"$f":"IF(Lønmodtager!$A24<>\"ÅÅÅ\",Lønmodtager!AP24,\"\")","v":""},{"$f":"IF(Lønmodtager!$A24<>\"ÅÅÅ\",Lønmodtager!AO24,\"\")","v":""},{"$f":"IF(Lønmodtager!$A24<>\"ÅÅÅ\",Lønmodtager!AQ24,\"\")","v":""},{"$f":"IF(Lønmodtager!$A24<>\"ÅÅÅ\",Lønmodtager!AR24,\"\")","v":""}]
[{"$f":"IF(Lønmodtager!$A25<>\"ÅÅÅ\",Lønmodtager!A25,\"\")","v":""},{"$f":"IF(Lønmodtager!$A25<>\"ÅÅÅ\",Lønmodtager!F25,\"\")","v":""},{"$f":"IF(Lønmodtager!$A25<>\"ÅÅÅ\",Lønmodtager!G25,\"\")","v":""},{"$f":"IF(Lønmodtager!$A25<>\"ÅÅÅ\",Lønmodtager!H25,\"\")","v":""},{"$f":"IF(Lønmodtager!$A25<>\"ÅÅÅ\",Lønmodtager!Q25,\"\")","v":""},{"$f":"IF(Lønmodtager!$A25<>\"ÅÅÅ\",Lønmodtager!R25,\"\")","v":""},{"$f":"IF(Lønmodtager!$A25<>\"ÅÅÅ\",Lønmodtager!AA25,\"\")","v":""},{"$f":"IF(Lønmodtager!$A25<>\"ÅÅÅ\",Lønmodtager!AB25,\"\")","v":""},{"$f":"IF(Lønmodtager!$A25<>\"ÅÅÅ\",Lønmodtager!AD25,\"\")","v":""},{"$f":"IF(Lønmodtager!$A25<>\"ÅÅÅ\",Lønmodtager!AC25,\"\")","v":""},{"$f":"IF(Lønmodtager!$A25<>\"ÅÅÅ\",Lønmodtager!AE25,\"\")","v":""},{"$f":"IF(Lønmodtager!$A25<>\"ÅÅÅ\",Lønmodtager!AF25,\"\")","v":""},{"$f":"IF(Lønmodtager!$A25<>\"ÅÅÅ\",Lønmodtager!AG25,\"\")","v":""},{"$f":"IF(Lønmodtager!$A25<>\"ÅÅÅ\",Lønmodtager!AK25,\"\")","v":""},{"$f":"IF(Lønmodtager!$A25<>\"ÅÅÅ\",Lønmodtager!AP25,\"\")","v":""},{"$f":"IF(Lønmodtager!$A25<>\"ÅÅÅ\",Lønmodtager!AO25,\"\")","v":""},{"$f":"IF(Lønmodtager!$A25<>\"ÅÅÅ\",Lønmodtager!AQ25,\"\")","v":""},{"$f":"IF(Lønmodtager!$A25<>\"ÅÅÅ\",Lønmodtager!AR25,\"\")","v":""}]
[{"$f":"IF(Lønmodtager!$A26<>\"ÅÅÅ\",Lønmodtager!A26,\"\")","v":""},{"$f":"IF(Lønmodtager!$A26<>\"ÅÅÅ\",Lønmodtager!F26,\"\")","v":""},{"$f":"IF(Lønmodtager!$A26<>\"ÅÅÅ\",Lønmodtager!G26,\"\")","v":""},{"$f":"IF(Lønmodtager!$A26<>\"ÅÅÅ\",Lønmodtager!H26,\"\")","v":""},{"$f":"IF(Lønmodtager!$A26<>\"ÅÅÅ\",Lønmodtager!Q26,\"\")","v":""},{"$f":"IF(Lønmodtager!$A26<>\"ÅÅÅ\",Lønmodtager!R26,\"\")","v":""},{"$f":"IF(Lønmodtager!$A26<>\"ÅÅÅ\",Lønmodtager!AA26,\"\")","v":""},{"$f":"IF(Lønmodtager!$A26<>\"ÅÅÅ\",Lønmodtager!AB26,\"\")","v":""},{"$f":"IF(Lønmodtager!$A26<>\"ÅÅÅ\",Lønmodtager!AD26,\"\")","v":""},{"$f":"IF(Lønmodtager!$A26<>\"ÅÅÅ\",Lønmodtager!AC26,\"\")","v":""},{"$f":"IF(Lønmodtager!$A26<>\"ÅÅÅ\",Lønmodtager!AE26,\"\")","v":""},{"$f":"IF(Lønmodtager!$A26<>\"ÅÅÅ\",Lønmodtager!AF26,\"\")","v":""},{"$f":"IF(Lønmodtager!$A26<>\"ÅÅÅ\",Lønmodtager!AG26,\"\")","v":""},{"$f":"IF(Lønmodtager!$A26<>\"ÅÅÅ\",Lønmodtager!AK26,\"\")","v":""},{"$f":"IF(Lønmodtager!$A26<>\"ÅÅÅ\",Lønmodtager!AP26,\"\")","v":""},{"$f":"IF(Lønmodtager!$A26<>\"ÅÅÅ\",Lønmodtager!AO26,\"\")","v":""},{"$f":"IF(Lønmodtager!$A26<>\"ÅÅÅ\",Lønmodtager!AQ26,\"\")","v":""},{"$f":"IF(Lønmodtager!$A26<>\"ÅÅÅ\",Lønmodtager!AR26,\"\")","v":""}]
[{"$f":"IF(Lønmodtager!$A27<>\"ÅÅÅ\",Lønmodtager!A27,\"\")","v":""},{"$f":"IF(Lønmodtager!$A27<>\"ÅÅÅ\",Lønmodtager!F27,\"\")","v":""},{"$f":"IF(Lønmodtager!$A27<>\"ÅÅÅ\",Lønmodtager!G27,\"\")","v":""},{"$f":"IF(Lønmodtager!$A27<>\"ÅÅÅ\",Lønmodtager!H27,\"\")","v":""},{"$f":"IF(Lønmodtager!$A27<>\"ÅÅÅ\",Lønmodtager!Q27,\"\")","v":""},{"$f":"IF(Lønmodtager!$A27<>\"ÅÅÅ\",Lønmodtager!R27,\"\")","v":""},{"$f":"IF(Lønmodtager!$A27<>\"ÅÅÅ\",Lønmodtager!AA27,\"\")","v":""},{"$f":"IF(Lønmodtager!$A27<>\"ÅÅÅ\",Lønmodtager!AB27,\"\")","v":""},{"$f":"IF(Lønmodtager!$A27<>\"ÅÅÅ\",Lønmodtager!AD27,\"\")","v":""},{"$f":"IF(Lønmodtager!$A27<>\"ÅÅÅ\",Lønmodtager!AC27,\"\")","v":""},{"$f":"IF(Lønmodtager!$A27<>\"ÅÅÅ\",Lønmodtager!AE27,\"\")","v":""},{"$f":"IF(Lønmodtager!$A27<>\"ÅÅÅ\",Lønmodtager!AF27,\"\")","v":""},{"$f":"IF(Lønmodtager!$A27<>\"ÅÅÅ\",Lønmodtager!AG27,\"\")","v":""},{"$f":"IF(Lønmodtager!$A27<>\"ÅÅÅ\",Lønmodtager!AK27,\"\")","v":""},{"$f":"IF(Lønmodtager!$A27<>\"ÅÅÅ\",Lønmodtager!AP27,\"\")","v":""},{"$f":"IF(Lønmodtager!$A27<>\"ÅÅÅ\",Lønmodtager!AO27,\"\")","v":""},{"$f":"IF(Lønmodtager!$A27<>\"ÅÅÅ\",Lønmodtager!AQ27,\"\")","v":""},{"$f":"IF(Lønmodtager!$A27<>\"ÅÅÅ\",Lønmodtager!AR27,\"\")","v":""}]
[{"$f":"IF(Lønmodtager!$A28<>\"ÅÅÅ\",Lønmodtager!A28,\"\")","v":""},{"$f":"IF(Lønmodtager!$A28<>\"ÅÅÅ\",Lønmodtager!F28,\"\")","v":""},{"$f":"IF(Lønmodtager!$A28<>\"ÅÅÅ\",Lønmodtager!G28,\"\")","v":""},{"$f":"IF(Lønmodtager!$A28<>\"ÅÅÅ\",Lønmodtager!H28,\"\")","v":""},{"$f":"IF(Lønmodtager!$A28<>\"ÅÅÅ\",Lønmodtager!Q28,\"\")","v":""},{"$f":"IF(Lønmodtager!$A28<>\"ÅÅÅ\",Lønmodtager!R28,\"\")","v":""},{"$f":"IF(Lønmodtager!$A28<>\"ÅÅÅ\",Lønmodtager!AA28,\"\")","v":""},{"$f":"IF(Lønmodtager!$A28<>\"ÅÅÅ\",Lønmodtager!AB28,\"\")","v":""},{"$f":"IF(Lønmodtager!$A28<>\"ÅÅÅ\",Lønmodtager!AD28,\"\")","v":""},{"$f":"IF(Lønmodtager!$A28<>\"ÅÅÅ\",Lønmodtager!AC28,\"\")","v":""},{"$f":"IF(Lønmodtager!$A28<>\"ÅÅÅ\",Lønmodtager!AE28,\"\")","v":""},{"$f":"IF(Lønmodtager!$A28<>\"ÅÅÅ\",Lønmodtager!AF28,\"\")","v":""},{"$f":"IF(Lønmodtager!$A28<>\"ÅÅÅ\",Lønmodtager!AG28,\"\")","v":""},{"$f":"IF(Lønmodtager!$A28<>\"ÅÅÅ\",Lønmodtager!AK28,\"\")","v":""},{"$f":"IF(Lønmodtager!$A28<>\"ÅÅÅ\",Lønmodtager!AP28,\"\")","v":""},{"$f":"IF(Lønmodtager!$A28<>\"ÅÅÅ\",Lønmodtager!AO28,\"\")","v":""},{"$f":"IF(Lønmodtager!$A28<>\"ÅÅÅ\",Lønmodtager!AQ28,\"\")","v":""},{"$f":"IF(Lønmodtager!$A28<>\"ÅÅÅ\",Lønmodtager!AR28,\"\")","v":""}]
[{"$f":"IF(Lønmodtager!$A29<>\"ÅÅÅ\",Lønmodtager!A29,\"\")","v":""},{"$f":"IF(Lønmodtager!$A29<>\"ÅÅÅ\",Lønmodtager!F29,\"\")","v":""},{"$f":"IF(Lønmodtager!$A29<>\"ÅÅÅ\",Lønmodtager!G29,\"\")","v":""},{"$f":"IF(Lønmodtager!$A29<>\"ÅÅÅ\",Lønmodtager!H29,\"\")","v":""},{"$f":"IF(Lønmodtager!$A29<>\"ÅÅÅ\",Lønmodtager!Q29,\"\")","v":""},{"$f":"IF(Lønmodtager!$A29<>\"ÅÅÅ\",Lønmodtager!R29,\"\")","v":""},{"$f":"IF(Lønmodtager!$A29<>\"ÅÅÅ\",Lønmodtager!AA29,\"\")","v":""},{"$f":"IF(Lønmodtager!$A29<>\"ÅÅÅ\",Lønmodtager!AB29,\"\")","v":""},{"$f":"IF(Lønmodtager!$A29<>\"ÅÅÅ\",Lønmodtager!AD29,\"\")","v":""},{"$f":"IF(Lønmodtager!$A29<>\"ÅÅÅ\",Lønmodtager!AC29,\"\")","v":""},{"$f":"IF(Lønmodtager!$A29<>\"ÅÅÅ\",Lønmodtager!AE29,\"\")","v":""},{"$f":"IF(Lønmodtager!$A29<>\"ÅÅÅ\",Lønmodtager!AF29,\"\")","v":""},{"$f":"IF(Lønmodtager!$A29<>\"ÅÅÅ\",Lønmodtager!AG29,\"\")","v":""},{"$f":"IF(Lønmodtager!$A29<>\"ÅÅÅ\",Lønmodtager!AK29,\"\")","v":""},{"$f":"IF(Lønmodtager!$A29<>\"ÅÅÅ\",Lønmodtager!AP29,\"\")","v":""},{"$f":"IF(Lønmodtager!$A29<>\"ÅÅÅ\",Lønmodtager!AO29,\"\")","v":""},{"$f":"IF(Lønmodtager!$A29<>\"ÅÅÅ\",Lønmodtager!AQ29,\"\")","v":""},{"$f":"IF(Lønmodtager!$A29<>\"ÅÅÅ\",Lønmodtager!AR29,\"\")","v":""}]
[{"$f":"IF(Lønmodtager!$A30<>\"ÅÅÅ\",Lønmodtager!A30,\"\")","v":""},{"$f":"IF(Lønmodtager!$A30<>\"ÅÅÅ\",Lønmodtager!F30,\"\")","v":""},{"$f":"IF(Lønmodtager!$A30<>\"ÅÅÅ\",Lønmodtager!G30,\"\")","v":""},{"$f":"IF(Lønmodtager!$A30<>\"ÅÅÅ\",Lønmodtager!H30,\"\")","v":""},{"$f":"IF(Lønmodtager!$A30<>\"ÅÅÅ\",Lønmodtager!Q30,\"\")","v":""},{"$f":"IF(Lønmodtager!$A30<>\"ÅÅÅ\",Lønmodtager!R30,\"\")","v":""},{"$f":"IF(Lønmodtager!$A30<>\"ÅÅÅ\",Lønmodtager!AA30,\"\")","v":""},{"$f":"IF(Lønmodtager!$A30<>\"ÅÅÅ\",Lønmodtager!AB30,\"\")","v":""},{"$f":"IF(Lønmodtager!$A30<>\"ÅÅÅ\",Lønmodtager!AD30,\"\")","v":""},{"$f":"IF(Lønmodtager!$A30<>\"ÅÅÅ\",Lønmodtager!AC30,\"\")","v":""},{"$f":"IF(Lønmodtager!$A30<>\"ÅÅÅ\",Lønmodtager!AE30,\"\")","v":""},{"$f":"IF(Lønmodtager!$A30<>\"ÅÅÅ\",Lønmodtager!AF30,\"\")","v":""},{"$f":"IF(Lønmodtager!$A30<>\"ÅÅÅ\",Lønmodtager!AG30,\"\")","v":""},{"$f":"IF(Lønmodtager!$A30<>\"ÅÅÅ\",Lønmodtager!AK30,\"\")","v":""},{"$f":"IF(Lønmodtager!$A30<>\"ÅÅÅ\",Lønmodtager!AP30,\"\")","v":""},{"$f":"IF(Lønmodtager!$A30<>\"ÅÅÅ\",Lønmodtager!AO30,\"\")","v":""},{"$f":"IF(Lønmodtager!$A30<>\"ÅÅÅ\",Lønmodtager!AQ30,\"\")","v":""},{"$f":"IF(Lønmodtager!$A30<>\"ÅÅÅ\",Lønmodtager!AR30,\"\")","v":""}]
[{"$f":"IF(Lønmodtager!$A31<>\"ÅÅÅ\",Lønmodtager!A31,\"\")","v":""},{"$f":"IF(Lønmodtager!$A31<>\"ÅÅÅ\",Lønmodtager!F31,\"\")","v":""},{"$f":"IF(Lønmodtager!$A31<>\"ÅÅÅ\",Lønmodtager!G31,\"\")","v":""},{"$f":"IF(Lønmodtager!$A31<>\"ÅÅÅ\",Lønmodtager!H31,\"\")","v":""},{"$f":"IF(Lønmodtager!$A31<>\"ÅÅÅ\",Lønmodtager!Q31,\"\")","v":""},{"$f":"IF(Lønmodtager!$A31<>\"ÅÅÅ\",Lønmodtager!R31,\"\")","v":""},{"$f":"IF(Lønmodtager!$A31<>\"ÅÅÅ\",Lønmodtager!AA31,\"\")","v":""},{"$f":"IF(Lønmodtager!$A31<>\"ÅÅÅ\",Lønmodtager!AB31,\"\")","v":""},{"$f":"IF(Lønmodtager!$A31<>\"ÅÅÅ\",Lønmodtager!AD31,\"\")","v":""},{"$f":"IF(Lønmodtager!$A31<>\"ÅÅÅ\",Lønmodtager!AC31,\"\")","v":""},{"$f":"IF(Lønmodtager!$A31<>\"ÅÅÅ\",Lønmodtager!AE31,\"\")","v":""},{"$f":"IF(Lønmodtager!$A31<>\"ÅÅÅ\",Lønmodtager!AF31,\"\")","v":""},{"$f":"IF(Lønmodtager!$A31<>\"ÅÅÅ\",Lønmodtager!AG31,\"\")","v":""},{"$f":"IF(Lønmodtager!$A31<>\"ÅÅÅ\",Lønmodtager!AK31,\"\")","v":""},{"$f":"IF(Lønmodtager!$A31<>\"ÅÅÅ\",Lønmodtager!AP31,\"\")","v":""},{"$f":"IF(Lønmodtager!$A31<>\"ÅÅÅ\",Lønmodtager!AO31,\"\")","v":""},{"$f":"IF(Lønmodtager!$A31<>\"ÅÅÅ\",Lønmodtager!AQ31,\"\")","v":""},{"$f":"IF(Lønmodtager!$A31<>\"ÅÅÅ\",Lønmodtager!AR31,\"\")","v":""}]
[{"$f":"IF(Lønmodtager!$A32<>\"ÅÅÅ\",Lønmodtager!A32,\"\")","v":""},{"$f":"IF(Lønmodtager!$A32<>\"ÅÅÅ\",Lønmodtager!F32,\"\")","v":""},{"$f":"IF(Lønmodtager!$A32<>\"ÅÅÅ\",Lønmodtager!G32,\"\")","v":""},{"$f":"IF(Lønmodtager!$A32<>\"ÅÅÅ\",Lønmodtager!H32,\"\")","v":""},{"$f":"IF(Lønmodtager!$A32<>\"ÅÅÅ\",Lønmodtager!Q32,\"\")","v":""},{"$f":"IF(Lønmodtager!$A32<>\"ÅÅÅ\",Lønmodtager!R32,\"\")","v":""},{"$f":"IF(Lønmodtager!$A32<>\"ÅÅÅ\",Lønmodtager!AA32,\"\")","v":""},{"$f":"IF(Lønmodtager!$A32<>\"ÅÅÅ\",Lønmodtager!AB32,\"\")","v":""},{"$f":"IF(Lønmodtager!$A32<>\"ÅÅÅ\",Lønmodtager!AD32,\"\")","v":""},{"$f":"IF(Lønmodtager!$A32<>\"ÅÅÅ\",Lønmodtager!AC32,\"\")","v":""},{"$f":"IF(Lønmodtager!$A32<>\"ÅÅÅ\",Lønmodtager!AE32,\"\")","v":""},{"$f":"IF(Lønmodtager!$A32<>\"ÅÅÅ\",Lønmodtager!AF32,\"\")","v":""},{"$f":"IF(Lønmodtager!$A32<>\"ÅÅÅ\",Lønmodtager!AG32,\"\")","v":""},{"$f":"IF(Lønmodtager!$A32<>\"ÅÅÅ\",Lønmodtager!AK32,\"\")","v":""},{"$f":"IF(Lønmodtager!$A32<>\"ÅÅÅ\",Lønmodtager!AP32,\"\")","v":""},{"$f":"IF(Lønmodtager!$A32<>\"ÅÅÅ\",Lønmodtager!AO32,\"\")","v":""},{"$f":"IF(Lønmodtager!$A32<>\"ÅÅÅ\",Lønmodtager!AQ32,\"\")","v":""},{"$f":"IF(Lønmodtager!$A32<>\"ÅÅÅ\",Lønmodtager!AR32,\"\")","v":""}]
[{"$f":"IF(Lønmodtager!$A33<>\"ÅÅÅ\",Lønmodtager!A33,\"\")","v":""},{"$f":"IF(Lønmodtager!$A33<>\"ÅÅÅ\",Lønmodtager!F33,\"\")","v":""},{"$f":"IF(Lønmodtager!$A33<>\"ÅÅÅ\",Lønmodtager!G33,\"\")","v":""},{"$f":"IF(Lønmodtager!$A33<>\"ÅÅÅ\",Lønmodtager!H33,\"\")","v":""},{"$f":"IF(Lønmodtager!$A33<>\"ÅÅÅ\",Lønmodtager!Q33,\"\")","v":""},{"$f":"IF(Lønmodtager!$A33<>\"ÅÅÅ\",Lønmodtager!R33,\"\")","v":""},{"$f":"IF(Lønmodtager!$A33<>\"ÅÅÅ\",Lønmodtager!AA33,\"\")","v":""},{"$f":"IF(Lønmodtager!$A33<>\"ÅÅÅ\",Lønmodtager!AB33,\"\")","v":""},{"$f":"IF(Lønmodtager!$A33<>\"ÅÅÅ\",Lønmodtager!AD33,\"\")","v":""},{"$f":"IF(Lønmodtager!$A33<>\"ÅÅÅ\",Lønmodtager!AC33,\"\")","v":""},{"$f":"IF(Lønmodtager!$A33<>\"ÅÅÅ\",Lønmodtager!AE33,\"\")","v":""},{"$f":"IF(Lønmodtager!$A33<>\"ÅÅÅ\",Lønmodtager!AF33,\"\")","v":""},{"$f":"IF(Lønmodtager!$A33<>\"ÅÅÅ\",Lønmodtager!AG33,\"\")","v":""},{"$f":"IF(Lønmodtager!$A33<>\"ÅÅÅ\",Lønmodtager!AK33,\"\")","v":""},{"$f":"IF(Lønmodtager!$A33<>\"ÅÅÅ\",Lønmodtager!AP33,\"\")","v":""},{"$f":"IF(Lønmodtager!$A33<>\"ÅÅÅ\",Lønmodtager!AO33,\"\")","v":""},{"$f":"IF(Lønmodtager!$A33<>\"ÅÅÅ\",Lønmodtager!AQ33,\"\")","v":""},{"$f":"IF(Lønmodtager!$A33<>\"ÅÅÅ\",Lønmodtager!AR33,\"\")","v":""}]
[{"$f":"IF(Lønmodtager!$A34<>\"ÅÅÅ\",Lønmodtager!A34,\"\")","v":""},{"$f":"IF(Lønmodtager!$A34<>\"ÅÅÅ\",Lønmodtager!F34,\"\")","v":""},{"$f":"IF(Lønmodtager!$A34<>\"ÅÅÅ\",Lønmodtager!G34,\"\")","v":""},{"$f":"IF(Lønmodtager!$A34<>\"ÅÅÅ\",Lønmodtager!H34,\"\")","v":""},{"$f":"IF(Lønmodtager!$A34<>\"ÅÅÅ\",Lønmodtager!Q34,\"\")","v":""},{"$f":"IF(Lønmodtager!$A34<>\"ÅÅÅ\",Lønmodtager!R34,\"\")","v":""},{"$f":"IF(Lønmodtager!$A34<>\"ÅÅÅ\",Lønmodtager!AA34,\"\")","v":""},{"$f":"IF(Lønmodtager!$A34<>\"ÅÅÅ\",Lønmodtager!AB34,\"\")","v":""},{"$f":"IF(Lønmodtager!$A34<>\"ÅÅÅ\",Lønmodtager!AD34,\"\")","v":""},{"$f":"IF(Lønmodtager!$A34<>\"ÅÅÅ\",Lønmodtager!AC34,\"\")","v":""},{"$f":"IF(Lønmodtager!$A34<>\"ÅÅÅ\",Lønmodtager!AE34,\"\")","v":""},{"$f":"IF(Lønmodtager!$A34<>\"ÅÅÅ\",Lønmodtager!AF34,\"\")","v":""},{"$f":"IF(Lønmodtager!$A34<>\"ÅÅÅ\",Lønmodtager!AG34,\"\")","v":""},{"$f":"IF(Lønmodtager!$A34<>\"ÅÅÅ\",Lønmodtager!AK34,\"\")","v":""},{"$f":"IF(Lønmodtager!$A34<>\"ÅÅÅ\",Lønmodtager!AP34,\"\")","v":""},{"$f":"IF(Lønmodtager!$A34<>\"ÅÅÅ\",Lønmodtager!AO34,\"\")","v":""},{"$f":"IF(Lønmodtager!$A34<>\"ÅÅÅ\",Lønmodtager!AQ34,\"\")","v":""},{"$f":"IF(Lønmodtager!$A34<>\"ÅÅÅ\",Lønmodtager!AR34,\"\")","v":""}]
[{"$f":"IF(Lønmodtager!$A35<>\"ÅÅÅ\",Lønmodtager!A35,\"\")","v":""},{"$f":"IF(Lønmodtager!$A35<>\"ÅÅÅ\",Lønmodtager!F35,\"\")","v":""},{"$f":"IF(Lønmodtager!$A35<>\"ÅÅÅ\",Lønmodtager!G35,\"\")","v":""},{"$f":"IF(Lønmodtager!$A35<>\"ÅÅÅ\",Lønmodtager!H35,\"\")","v":""},{"$f":"IF(Lønmodtager!$A35<>\"ÅÅÅ\",Lønmodtager!Q35,\"\")","v":""},{"$f":"IF(Lønmodtager!$A35<>\"ÅÅÅ\",Lønmodtager!R35,\"\")","v":""},{"$f":"IF(Lønmodtager!$A35<>\"ÅÅÅ\",Lønmodtager!AA35,\"\")","v":""},{"$f":"IF(Lønmodtager!$A35<>\"ÅÅÅ\",Lønmodtager!AB35,\"\")","v":""},{"$f":"IF(Lønmodtager!$A35<>\"ÅÅÅ\",Lønmodtager!AD35,\"\")","v":""},{"$f":"IF(Lønmodtager!$A35<>\"ÅÅÅ\",Lønmodtager!AC35,\"\")","v":""},{"$f":"IF(Lønmodtager!$A35<>\"ÅÅÅ\",Lønmodtager!AE35,\"\")","v":""},{"$f":"IF(Lønmodtager!$A35<>\"ÅÅÅ\",Lønmodtager!AF35,\"\")","v":""},{"$f":"IF(Lønmodtager!$A35<>\"ÅÅÅ\",Lønmodtager!AG35,\"\")","v":""},{"$f":"IF(Lønmodtager!$A35<>\"ÅÅÅ\",Lønmodtager!AK35,\"\")","v":""},{"$f":"IF(Lønmodtager!$A35<>\"ÅÅÅ\",Lønmodtager!AP35,\"\")","v":""},{"$f":"IF(Lønmodtager!$A35<>\"ÅÅÅ\",Lønmodtager!AO35,\"\")","v":""},{"$f":"IF(Lønmodtager!$A35<>\"ÅÅÅ\",Lønmodtager!AQ35,\"\")","v":""},{"$f":"IF(Lønmodtager!$A35<>\"ÅÅÅ\",Lønmodtager!AR35,\"\")","v":""}]
[{"$f":"IF(Lønmodtager!$A36<>\"ÅÅÅ\",Lønmodtager!A36,\"\")","v":""},{"$f":"IF(Lønmodtager!$A36<>\"ÅÅÅ\",Lønmodtager!F36,\"\")","v":""},{"$f":"IF(Lønmodtager!$A36<>\"ÅÅÅ\",Lønmodtager!G36,\"\")","v":""},{"$f":"IF(Lønmodtager!$A36<>\"ÅÅÅ\",Lønmodtager!H36,\"\")","v":""},{"$f":"IF(Lønmodtager!$A36<>\"ÅÅÅ\",Lønmodtager!Q36,\"\")","v":""},{"$f":"IF(Lønmodtager!$A36<>\"ÅÅÅ\",Lønmodtager!R36,\"\")","v":""},{"$f":"IF(Lønmodtager!$A36<>\"ÅÅÅ\",Lønmodtager!AA36,\"\")","v":""},{"$f":"IF(Lønmodtager!$A36<>\"ÅÅÅ\",Lønmodtager!AB36,\"\")","v":""},{"$f":"IF(Lønmodtager!$A36<>\"ÅÅÅ\",Lønmodtager!AD36,\"\")","v":""},{"$f":"IF(Lønmodtager!$A36<>\"ÅÅÅ\",Lønmodtager!AC36,\"\")","v":""},{"$f":"IF(Lønmodtager!$A36<>\"ÅÅÅ\",Lønmodtager!AE36,\"\")","v":""},{"$f":"IF(Lønmodtager!$A36<>\"ÅÅÅ\",Lønmodtager!AF36,\"\")","v":""},{"$f":"IF(Lønmodtager!$A36<>\"ÅÅÅ\",Lønmodtager!AG36,\"\")","v":""},{"$f":"IF(Lønmodtager!$A36<>\"ÅÅÅ\",Lønmodtager!AK36,\"\")","v":""},{"$f":"IF(Lønmodtager!$A36<>\"ÅÅÅ\",Lønmodtager!AP36,\"\")","v":""},{"$f":"IF(Lønmodtager!$A36<>\"ÅÅÅ\",Lønmodtager!AO36,\"\")","v":""},{"$f":"IF(Lønmodtager!$A36<>\"ÅÅÅ\",Lønmodtager!AQ36,\"\")","v":""},{"$f":"IF(Lønmodtager!$A36<>\"ÅÅÅ\",Lønmodtager!AR36,\"\")","v":""}]
[{"$f":"IF(Lønmodtager!$A37<>\"ÅÅÅ\",Lønmodtager!A37,\"\")","v":""},{"$f":"IF(Lønmodtager!$A37<>\"ÅÅÅ\",Lønmodtager!F37,\"\")","v":""},{"$f":"IF(Lønmodtager!$A37<>\"ÅÅÅ\",Lønmodtager!G37,\"\")","v":""},{"$f":"IF(Lønmodtager!$A37<>\"ÅÅÅ\",Lønmodtager!H37,\"\")","v":""},{"$f":"IF(Lønmodtager!$A37<>\"ÅÅÅ\",Lønmodtager!Q37,\"\")","v":""},{"$f":"IF(Lønmodtager!$A37<>\"ÅÅÅ\",Lønmodtager!R37,\"\")","v":""},{"$f":"IF(Lønmodtager!$A37<>\"ÅÅÅ\",Lønmodtager!AA37,\"\")","v":""},{"$f":"IF(Lønmodtager!$A37<>\"ÅÅÅ\",Lønmodtager!AB37,\"\")","v":""},{"$f":"IF(Lønmodtager!$A37<>\"ÅÅÅ\",Lønmodtager!AD37,\"\")","v":""},{"$f":"IF(Lønmodtager!$A37<>\"ÅÅÅ\",Lønmodtager!AC37,\"\")","v":""},{"$f":"IF(Lønmodtager!$A37<>\"ÅÅÅ\",Lønmodtager!AE37,\"\")","v":""},{"$f":"IF(Lønmodtager!$A37<>\"ÅÅÅ\",Lønmodtager!AF37,\"\")","v":""},{"$f":"IF(Lønmodtager!$A37<>\"ÅÅÅ\",Lønmodtager!AG37,\"\")","v":""},{"$f":"IF(Lønmodtager!$A37<>\"ÅÅÅ\",Lønmodtager!AK37,\"\")","v":""},{"$f":"IF(Lønmodtager!$A37<>\"ÅÅÅ\",Lønmodtager!AP37,\"\")","v":""},{"$f":"IF(Lønmodtager!$A37<>\"ÅÅÅ\",Lønmodtager!AO37,\"\")","v":""},{"$f":"IF(Lønmodtager!$A37<>\"ÅÅÅ\",Lønmodtager!AQ37,\"\")","v":""},{"$f":"IF(Lønmodtager!$A37<>\"ÅÅÅ\",Lønmodtager!AR37,\"\")","v":""}]
[{"$f":"IF(Lønmodtager!$A38<>\"ÅÅÅ\",Lønmodtager!A38,\"\")","v":""},{"$f":"IF(Lønmodtager!$A38<>\"ÅÅÅ\",Lønmodtager!F38,\"\")","v":""},{"$f":"IF(Lønmodtager!$A38<>\"ÅÅÅ\",Lønmodtager!G38,\"\")","v":""},{"$f":"IF(Lønmodtager!$A38<>\"ÅÅÅ\",Lønmodtager!H38,\"\")","v":""},{"$f":"IF(Lønmodtager!$A38<>\"ÅÅÅ\",Lønmodtager!Q38,\"\")","v":""},{"$f":"IF(Lønmodtager!$A38<>\"ÅÅÅ\",Lønmodtager!R38,\"\")","v":""},{"$f":"IF(Lønmodtager!$A38<>\"ÅÅÅ\",Lønmodtager!AA38,\"\")","v":""},{"$f":"IF(Lønmodtager!$A38<>\"ÅÅÅ\",Lønmodtager!AB38,\"\")","v":""},{"$f":"IF(Lønmodtager!$A38<>\"ÅÅÅ\",Lønmodtager!AD38,\"\")","v":""},{"$f":"IF(Lønmodtager!$A38<>\"ÅÅÅ\",Lønmodtager!AC38,\"\")","v":""},{"$f":"IF(Lønmodtager!$A38<>\"ÅÅÅ\",Lønmodtager!AE38,\"\")","v":""},{"$f":"IF(Lønmodtager!$A38<>\"ÅÅÅ\",Lønmodtager!AF38,\"\")","v":""},{"$f":"IF(Lønmodtager!$A38<>\"ÅÅÅ\",Lønmodtager!AG38,\"\")","v":""},{"$f":"IF(Lønmodtager!$A38<>\"ÅÅÅ\",Lønmodtager!AK38,\"\")","v":""},{"$f":"IF(Lønmodtager!$A38<>\"ÅÅÅ\",Lønmodtager!AP38,\"\")","v":""},{"$f":"IF(Lønmodtager!$A38<>\"ÅÅÅ\",Lønmodtager!AO38,\"\")","v":""},{"$f":"IF(Lønmodtager!$A38<>\"ÅÅÅ\",Lønmodtager!AQ38,\"\")","v":""},{"$f":"IF(Lønmodtager!$A38<>\"ÅÅÅ\",Lønmodtager!AR38,\"\")","v":""}]
[{"$f":"IF(Lønmodtager!$A39<>\"ÅÅÅ\",Lønmodtager!A39,\"\")","v":""},{"$f":"IF(Lønmodtager!$A39<>\"ÅÅÅ\",Lønmodtager!F39,\"\")","v":""},{"$f":"IF(Lønmodtager!$A39<>\"ÅÅÅ\",Lønmodtager!G39,\"\")","v":""},{"$f":"IF(Lønmodtager!$A39<>\"ÅÅÅ\",Lønmodtager!H39,\"\")","v":""},{"$f":"IF(Lønmodtager!$A39<>\"ÅÅÅ\",Lønmodtager!Q39,\"\")","v":""},{"$f":"IF(Lønmodtager!$A39<>\"ÅÅÅ\",Lønmodtager!R39,\"\")","v":""},{"$f":"IF(Lønmodtager!$A39<>\"ÅÅÅ\",Lønmodtager!AA39,\"\")","v":""},{"$f":"IF(Lønmodtager!$A39<>\"ÅÅÅ\",Lønmodtager!AB39,\"\")","v":""},{"$f":"IF(Lønmodtager!$A39<>\"ÅÅÅ\",Lønmodtager!AD39,\"\")","v":""},{"$f":"IF(Lønmodtager!$A39<>\"ÅÅÅ\",Lønmodtager!AC39,\"\")","v":""},{"$f":"IF(Lønmodtager!$A39<>\"ÅÅÅ\",Lønmodtager!AE39,\"\")","v":""},{"$f":"IF(Lønmodtager!$A39<>\"ÅÅÅ\",Lønmodtager!AF39,\"\")","v":""},{"$f":"IF(Lønmodtager!$A39<>\"ÅÅÅ\",Lønmodtager!AG39,\"\")","v":""},{"$f":"IF(Lønmodtager!$A39<>\"ÅÅÅ\",Lønmodtager!AK39,\"\")","v":""},{"$f":"IF(Lønmodtager!$A39<>\"ÅÅÅ\",Lønmodtager!AP39,\"\")","v":""},{"$f":"IF(Lønmodtager!$A39<>\"ÅÅÅ\",Lønmodtager!AO39,\"\")","v":""},{"$f":"IF(Lønmodtager!$A39<>\"ÅÅÅ\",Lønmodtager!AQ39,\"\")","v":""},{"$f":"IF(Lønmodtager!$A39<>\"ÅÅÅ\",Lønmodtager!AR39,\"\")","v":""}]
[{"$f":"IF(Lønmodtager!$A40<>\"ÅÅÅ\",Lønmodtager!A40,\"\")","v":""},{"$f":"IF(Lønmodtager!$A40<>\"ÅÅÅ\",Lønmodtager!F40,\"\")","v":""},{"$f":"IF(Lønmodtager!$A40<>\"ÅÅÅ\",Lønmodtager!G40,\"\")","v":""},{"$f":"IF(Lønmodtager!$A40<>\"ÅÅÅ\",Lønmodtager!H40,\"\")","v":""},{"$f":"IF(Lønmodtager!$A40<>\"ÅÅÅ\",Lønmodtager!Q40,\"\")","v":""},{"$f":"IF(Lønmodtager!$A40<>\"ÅÅÅ\",Lønmodtager!R40,\"\")","v":""},{"$f":"IF(Lønmodtager!$A40<>\"ÅÅÅ\",Lønmodtager!AA40,\"\")","v":""},{"$f":"IF(Lønmodtager!$A40<>\"ÅÅÅ\",Lønmodtager!AB40,\"\")","v":""},{"$f":"IF(Lønmodtager!$A40<>\"ÅÅÅ\",Lønmodtager!AD40,\"\")","v":""},{"$f":"IF(Lønmodtager!$A40<>\"ÅÅÅ\",Lønmodtager!AC40,\"\")","v":""},{"$f":"IF(Lønmodtager!$A40<>\"ÅÅÅ\",Lønmodtager!AE40,\"\")","v":""},{"$f":"IF(Lønmodtager!$A40<>\"ÅÅÅ\",Lønmodtager!AF40,\"\")","v":""},{"$f":"IF(Lønmodtager!$A40<>\"ÅÅÅ\",Lønmodtager!AG40,\"\")","v":""},{"$f":"IF(Lønmodtager!$A40<>\"ÅÅÅ\",Lønmodtager!AK40,\"\")","v":""},{"$f":"IF(Lønmodtager!$A40<>\"ÅÅÅ\",Lønmodtager!AP40,\"\")","v":""},{"$f":"IF(Lønmodtager!$A40<>\"ÅÅÅ\",Lønmodtager!AO40,\"\")","v":""},{"$f":"IF(Lønmodtager!$A40<>\"ÅÅÅ\",Lønmodtager!AQ40,\"\")","v":""},{"$f":"IF(Lønmodtager!$A40<>\"ÅÅÅ\",Lønmodtager!AR40,\"\")","v":""}]
[{"$f":"IF(Lønmodtager!$A41<>\"ÅÅÅ\",Lønmodtager!A41,\"\")","v":""},{"$f":"IF(Lønmodtager!$A41<>\"ÅÅÅ\",Lønmodtager!F41,\"\")","v":""},{"$f":"IF(Lønmodtager!$A41<>\"ÅÅÅ\",Lønmodtager!G41,\"\")","v":""},{"$f":"IF(Lønmodtager!$A41<>\"ÅÅÅ\",Lønmodtager!H41,\"\")","v":""},{"$f":"IF(Lønmodtager!$A41<>\"ÅÅÅ\",Lønmodtager!Q41,\"\")","v":""},{"$f":"IF(Lønmodtager!$A41<>\"ÅÅÅ\",Lønmodtager!R41,\"\")","v":""},{"$f":"IF(Lønmodtager!$A41<>\"ÅÅÅ\",Lønmodtager!AA41,\"\")","v":""},{"$f":"IF(Lønmodtager!$A41<>\"ÅÅÅ\",Lønmodtager!AB41,\"\")","v":""},{"$f":"IF(Lønmodtager!$A41<>\"ÅÅÅ\",Lønmodtager!AD41,\"\")","v":""},{"$f":"IF(Lønmodtager!$A41<>\"ÅÅÅ\",Lønmodtager!AC41,\"\")","v":""},{"$f":"IF(Lønmodtager!$A41<>\"ÅÅÅ\",Lønmodtager!AE41,\"\")","v":""},{"$f":"IF(Lønmodtager!$A41<>\"ÅÅÅ\",Lønmodtager!AF41,\"\")","v":""},{"$f":"IF(Lønmodtager!$A41<>\"ÅÅÅ\",Lønmodtager!AG41,\"\")","v":""},{"$f":"IF(Lønmodtager!$A41<>\"ÅÅÅ\",Lønmodtager!AK41,\"\")","v":""},{"$f":"IF(Lønmodtager!$A41<>\"ÅÅÅ\",Lønmodtager!AP41,\"\")","v":""},{"$f":"IF(Lønmodtager!$A41<>\"ÅÅÅ\",Lønmodtager!AO41,\"\")","v":""},{"$f":"IF(Lønmodtager!$A41<>\"ÅÅÅ\",Lønmodtager!AQ41,\"\")","v":""},{"$f":"IF(Lønmodtager!$A41<>\"ÅÅÅ\",Lønmodtager!AR41,\"\")","v":""}]
[{"$f":"IF(Lønmodtager!$A42<>\"ÅÅÅ\",Lønmodtager!A42,\"\")","v":""},{"$f":"IF(Lønmodtager!$A42<>\"ÅÅÅ\",Lønmodtager!F42,\"\")","v":""},{"$f":"IF(Lønmodtager!$A42<>\"ÅÅÅ\",Lønmodtager!G42,\"\")","v":""},{"$f":"IF(Lønmodtager!$A42<>\"ÅÅÅ\",Lønmodtager!H42,\"\")","v":""},{"$f":"IF(Lønmodtager!$A42<>\"ÅÅÅ\",Lønmodtager!Q42,\"\")","v":""},{"$f":"IF(Lønmodtager!$A42<>\"ÅÅÅ\",Lønmodtager!R42,\"\")","v":""},{"$f":"IF(Lønmodtager!$A42<>\"ÅÅÅ\",Lønmodtager!AA42,\"\")","v":""},{"$f":"IF(Lønmodtager!$A42<>\"ÅÅÅ\",Lønmodtager!AB42,\"\")","v":""},{"$f":"IF(Lønmodtager!$A42<>\"ÅÅÅ\",Lønmodtager!AD42,\"\")","v":""},{"$f":"IF(Lønmodtager!$A42<>\"ÅÅÅ\",Lønmodtager!AC42,\"\")","v":""},{"$f":"IF(Lønmodtager!$A42<>\"ÅÅÅ\",Lønmodtager!AE42,\"\")","v":""},{"$f":"IF(Lønmodtager!$A42<>\"ÅÅÅ\",Lønmodtager!AF42,\"\")","v":""},{"$f":"IF(Lønmodtager!$A42<>\"ÅÅÅ\",Lønmodtager!AG42,\"\")","v":""},{"$f":"IF(Lønmodtager!$A42<>\"ÅÅÅ\",Lønmodtager!AK42,\"\")","v":""},{"$f":"IF(Lønmodtager!$A42<>\"ÅÅÅ\",Lønmodtager!AP42,\"\")","v":""},{"$f":"IF(Lønmodtager!$A42<>\"ÅÅÅ\",Lønmodtager!AO42,\"\")","v":""},{"$f":"IF(Lønmodtager!$A42<>\"ÅÅÅ\",Lønmodtager!AQ42,\"\")","v":""},{"$f":"IF(Lønmodtager!$A42<>\"ÅÅÅ\",Lønmodtager!AR42,\"\")","v":""}]
[{"$f":"IF(Lønmodtager!$A43<>\"ÅÅÅ\",Lønmodtager!A43,\"\")","v":""},{"$f":"IF(Lønmodtager!$A43<>\"ÅÅÅ\",Lønmodtager!F43,\"\")","v":""},{"$f":"IF(Lønmodtager!$A43<>\"ÅÅÅ\",Lønmodtager!G43,\"\")","v":""},{"$f":"IF(Lønmodtager!$A43<>\"ÅÅÅ\",Lønmodtager!H43,\"\")","v":""},{"$f":"IF(Lønmodtager!$A43<>\"ÅÅÅ\",Lønmodtager!Q43,\"\")","v":""},{"$f":"IF(Lønmodtager!$A43<>\"ÅÅÅ\",Lønmodtager!R43,\"\")","v":""},{"$f":"IF(Lønmodtager!$A43<>\"ÅÅÅ\",Lønmodtager!AA43,\"\")","v":""},{"$f":"IF(Lønmodtager!$A43<>\"ÅÅÅ\",Lønmodtager!AB43,\"\")","v":""},{"$f":"IF(Lønmodtager!$A43<>\"ÅÅÅ\",Lønmodtager!AD43,\"\")","v":""},{"$f":"IF(Lønmodtager!$A43<>\"ÅÅÅ\",Lønmodtager!AC43,\"\")","v":""},{"$f":"IF(Lønmodtager!$A43<>\"ÅÅÅ\",Lønmodtager!AE43,\"\")","v":""},{"$f":"IF(Lønmodtager!$A43<>\"ÅÅÅ\",Lønmodtager!AF43,\"\")","v":""},{"$f":"IF(Lønmodtager!$A43<>\"ÅÅÅ\",Lønmodtager!AG43,\"\")","v":""},{"$f":"IF(Lønmodtager!$A43<>\"ÅÅÅ\",Lønmodtager!AK43,\"\")","v":""},{"$f":"IF(Lønmodtager!$A43<>\"ÅÅÅ\",Lønmodtager!AP43,\"\")","v":""},{"$f":"IF(Lønmodtager!$A43<>\"ÅÅÅ\",Lønmodtager!AO43,\"\")","v":""},{"$f":"IF(Lønmodtager!$A43<>\"ÅÅÅ\",Lønmodtager!AQ43,\"\")","v":""},{"$f":"IF(Lønmodtager!$A43<>\"ÅÅÅ\",Lønmodtager!AR43,\"\")","v":""}]
[{"$f":"IF(Lønmodtager!$A44<>\"ÅÅÅ\",Lønmodtager!A44,\"\")","v":""},{"$f":"IF(Lønmodtager!$A44<>\"ÅÅÅ\",Lønmodtager!F44,\"\")","v":""},{"$f":"IF(Lønmodtager!$A44<>\"ÅÅÅ\",Lønmodtager!G44,\"\")","v":""},{"$f":"IF(Lønmodtager!$A44<>\"ÅÅÅ\",Lønmodtager!H44,\"\")","v":""},{"$f":"IF(Lønmodtager!$A44<>\"ÅÅÅ\",Lønmodtager!Q44,\"\")","v":""},{"$f":"IF(Lønmodtager!$A44<>\"ÅÅÅ\",Lønmodtager!R44,\"\")","v":""},{"$f":"IF(Lønmodtager!$A44<>\"ÅÅÅ\",Lønmodtager!AA44,\"\")","v":""},{"$f":"IF(Lønmodtager!$A44<>\"ÅÅÅ\",Lønmodtager!AB44,\"\")","v":""},{"$f":"IF(Lønmodtager!$A44<>\"ÅÅÅ\",Lønmodtager!AD44,\"\")","v":""},{"$f":"IF(Lønmodtager!$A44<>\"ÅÅÅ\",Lønmodtager!AC44,\"\")","v":""},{"$f":"IF(Lønmodtager!$A44<>\"ÅÅÅ\",Lønmodtager!AE44,\"\")","v":""},{"$f":"IF(Lønmodtager!$A44<>\"ÅÅÅ\",Lønmodtager!AF44,\"\")","v":""},{"$f":"IF(Lønmodtager!$A44<>\"ÅÅÅ\",Lønmodtager!AG44,\"\")","v":""},{"$f":"IF(Lønmodtager!$A44<>\"ÅÅÅ\",Lønmodtager!AK44,\"\")","v":""},{"$f":"IF(Lønmodtager!$A44<>\"ÅÅÅ\",Lønmodtager!AP44,\"\")","v":""},{"$f":"IF(Lønmodtager!$A44<>\"ÅÅÅ\",Lønmodtager!AO44,\"\")","v":""},{"$f":"IF(Lønmodtager!$A44<>\"ÅÅÅ\",Lønmodtager!AQ44,\"\")","v":""},{"$f":"IF(Lønmodtager!$A44<>\"ÅÅÅ\",Lønmodtager!AR44,\"\")","v":""}]
[{"$f":"IF(Lønmodtager!$A45<>\"ÅÅÅ\",Lønmodtager!A45,\"\")","v":""},{"$f":"IF(Lønmodtager!$A45<>\"ÅÅÅ\",Lønmodtager!F45,\"\")","v":""},{"$f":"IF(Lønmodtager!$A45<>\"ÅÅÅ\",Lønmodtager!G45,\"\")","v":""},{"$f":"IF(Lønmodtager!$A45<>\"ÅÅÅ\",Lønmodtager!H45,\"\")","v":""},{"$f":"IF(Lønmodtager!$A45<>\"ÅÅÅ\",Lønmodtager!Q45,\"\")","v":""},{"$f":"IF(Lønmodtager!$A45<>\"ÅÅÅ\",Lønmodtager!R45,\"\")","v":""},{"$f":"IF(Lønmodtager!$A45<>\"ÅÅÅ\",Lønmodtager!AA45,\"\")","v":""},{"$f":"IF(Lønmodtager!$A45<>\"ÅÅÅ\",Lønmodtager!AB45,\"\")","v":""},{"$f":"IF(Lønmodtager!$A45<>\"ÅÅÅ\",Lønmodtager!AD45,\"\")","v":""},{"$f":"IF(Lønmodtager!$A45<>\"ÅÅÅ\",Lønmodtager!AC45,\"\")","v":""},{"$f":"IF(Lønmodtager!$A45<>\"ÅÅÅ\",Lønmodtager!AE45,\"\")","v":""},{"$f":"IF(Lønmodtager!$A45<>\"ÅÅÅ\",Lønmodtager!AF45,\"\")","v":""},{"$f":"IF(Lønmodtager!$A45<>\"ÅÅÅ\",Lønmodtager!AG45,\"\")","v":""},{"$f":"IF(Lønmodtager!$A45<>\"ÅÅÅ\",Lønmodtager!AK45,\"\")","v":""},{"$f":"IF(Lønmodtager!$A45<>\"ÅÅÅ\",Lønmodtager!AP45,\"\")","v":""},{"$f":"IF(Lønmodtager!$A45<>\"ÅÅÅ\",Lønmodtager!AO45,\"\")","v":""},{"$f":"IF(Lønmodtager!$A45<>\"ÅÅÅ\",Lønmodtager!AQ45,\"\")","v":""},{"$f":"IF(Lønmodtager!$A45<>\"ÅÅÅ\",Lønmodtager!AR45,\"\")","v":""}]
[{"$f":"IF(Lønmodtager!$A46<>\"ÅÅÅ\",Lønmodtager!A46,\"\")","v":""},{"$f":"IF(Lønmodtager!$A46<>\"ÅÅÅ\",Lønmodtager!F46,\"\")","v":""},{"$f":"IF(Lønmodtager!$A46<>\"ÅÅÅ\",Lønmodtager!G46,\"\")","v":""},{"$f":"IF(Lønmodtager!$A46<>\"ÅÅÅ\",Lønmodtager!H46,\"\")","v":""},{"$f":"IF(Lønmodtager!$A46<>\"ÅÅÅ\",Lønmodtager!Q46,\"\")","v":""},{"$f":"IF(Lønmodtager!$A46<>\"ÅÅÅ\",Lønmodtager!R46,\"\")","v":""},{"$f":"IF(Lønmodtager!$A46<>\"ÅÅÅ\",Lønmodtager!AA46,\"\")","v":""},{"$f":"IF(Lønmodtager!$A46<>\"ÅÅÅ\",Lønmodtager!AB46,\"\")","v":""},{"$f":"IF(Lønmodtager!$A46<>\"ÅÅÅ\",Lønmodtager!AD46,\"\")","v":""},{"$f":"IF(Lønmodtager!$A46<>\"ÅÅÅ\",Lønmodtager!AC46,\"\")","v":""},{"$f":"IF(Lønmodtager!$A46<>\"ÅÅÅ\",Lønmodtager!AE46,\"\")","v":""},{"$f":"IF(Lønmodtager!$A46<>\"ÅÅÅ\",Lønmodtager!AF46,\"\")","v":""},{"$f":"IF(Lønmodtager!$A46<>\"ÅÅÅ\",Lønmodtager!AG46,\"\")","v":""},{"$f":"IF(Lønmodtager!$A46<>\"ÅÅÅ\",Lønmodtager!AK46,\"\")","v":""},{"$f":"IF(Lønmodtager!$A46<>\"ÅÅÅ\",Lønmodtager!AP46,\"\")","v":""},{"$f":"IF(Lønmodtager!$A46<>\"ÅÅÅ\",Lønmodtager!AO46,\"\")","v":""},{"$f":"IF(Lønmodtager!$A46<>\"ÅÅÅ\",Lønmodtager!AQ46,\"\")","v":""},{"$f":"IF(Lønmodtager!$A46<>\"ÅÅÅ\",Lønmodtager!AR46,\"\")","v":""}]
[{"$f":"IF(Lønmodtager!$A47<>\"ÅÅÅ\",Lønmodtager!A47,\"\")","v":""},{"$f":"IF(Lønmodtager!$A47<>\"ÅÅÅ\",Lønmodtager!F47,\"\")","v":""},{"$f":"IF(Lønmodtager!$A47<>\"ÅÅÅ\",Lønmodtager!G47,\"\")","v":""},{"$f":"IF(Lønmodtager!$A47<>\"ÅÅÅ\",Lønmodtager!H47,\"\")","v":""},{"$f":"IF(Lønmodtager!$A47<>\"ÅÅÅ\",Lønmodtager!Q47,\"\")","v":""},{"$f":"IF(Lønmodtager!$A47<>\"ÅÅÅ\",Lønmodtager!R47,\"\")","v":""},{"$f":"IF(Lønmodtager!$A47<>\"ÅÅÅ\",Lønmodtager!AA47,\"\")","v":""},{"$f":"IF(Lønmodtager!$A47<>\"ÅÅÅ\",Lønmodtager!AB47,\"\")","v":""},{"$f":"IF(Lønmodtager!$A47<>\"ÅÅÅ\",Lønmodtager!AD47,\"\")","v":""},{"$f":"IF(Lønmodtager!$A47<>\"ÅÅÅ\",Lønmodtager!AC47,\"\")","v":""},{"$f":"IF(Lønmodtager!$A47<>\"ÅÅÅ\",Lønmodtager!AE47,\"\")","v":""},{"$f":"IF(Lønmodtager!$A47<>\"ÅÅÅ\",Lønmodtager!AF47,\"\")","v":""},{"$f":"IF(Lønmodtager!$A47<>\"ÅÅÅ\",Lønmodtager!AG47,\"\")","v":""},{"$f":"IF(Lønmodtager!$A47<>\"ÅÅÅ\",Lønmodtager!AK47,\"\")","v":""},{"$f":"IF(Lønmodtager!$A47<>\"ÅÅÅ\",Lønmodtager!AP47,\"\")","v":""},{"$f":"IF(Lønmodtager!$A47<>\"ÅÅÅ\",Lønmodtager!AO47,\"\")","v":""},{"$f":"IF(Lønmodtager!$A47<>\"ÅÅÅ\",Lønmodtager!AQ47,\"\")","v":""},{"$f":"IF(Lønmodtager!$A47<>\"ÅÅÅ\",Lønmodtager!AR47,\"\")","v":""}]
[{"$f":"IF(Lønmodtager!$A48<>\"ÅÅÅ\",Lønmodtager!A48,\"\")","v":""},{"$f":"IF(Lønmodtager!$A48<>\"ÅÅÅ\",Lønmodtager!F48,\"\")","v":""},{"$f":"IF(Lønmodtager!$A48<>\"ÅÅÅ\",Lønmodtager!G48,\"\")","v":""},{"$f":"IF(Lønmodtager!$A48<>\"ÅÅÅ\",Lønmodtager!H48,\"\")","v":""},{"$f":"IF(Lønmodtager!$A48<>\"ÅÅÅ\",Lønmodtager!Q48,\"\")","v":""},{"$f":"IF(Lønmodtager!$A48<>\"ÅÅÅ\",Lønmodtager!R48,\"\")","v":""},{"$f":"IF(Lønmodtager!$A48<>\"ÅÅÅ\",Lønmodtager!AA48,\"\")","v":""},{"$f":"IF(Lønmodtager!$A48<>\"ÅÅÅ\",Lønmodtager!AB48,\"\")","v":""},{"$f":"IF(Lønmodtager!$A48<>\"ÅÅÅ\",Lønmodtager!AD48,\"\")","v":""},{"$f":"IF(Lønmodtager!$A48<>\"ÅÅÅ\",Lønmodtager!AC48,\"\")","v":""},{"$f":"IF(Lønmodtager!$A48<>\"ÅÅÅ\",Lønmodtager!AE48,\"\")","v":""},{"$f":"IF(Lønmodtager!$A48<>\"ÅÅÅ\",Lønmodtager!AF48,\"\")","v":""},{"$f":"IF(Lønmodtager!$A48<>\"ÅÅÅ\",Lønmodtager!AG48,\"\")","v":""},{"$f":"IF(Lønmodtager!$A48<>\"ÅÅÅ\",Lønmodtager!AK48,\"\")","v":""},{"$f":"IF(Lønmodtager!$A48<>\"ÅÅÅ\",Lønmodtager!AP48,\"\")","v":""},{"$f":"IF(Lønmodtager!$A48<>\"ÅÅÅ\",Lønmodtager!AO48,\"\")","v":""},{"$f":"IF(Lønmodtager!$A48<>\"ÅÅÅ\",Lønmodtager!AQ48,\"\")","v":""},{"$f":"IF(Lønmodtager!$A48<>\"ÅÅÅ\",Lønmodtager!AR48,\"\")","v":""}]
[{"$f":"IF(Lønmodtager!$A49<>\"ÅÅÅ\",Lønmodtager!A49,\"\")","v":""},{"$f":"IF(Lønmodtager!$A49<>\"ÅÅÅ\",Lønmodtager!F49,\"\")","v":""},{"$f":"IF(Lønmodtager!$A49<>\"ÅÅÅ\",Lønmodtager!G49,\"\")","v":""},{"$f":"IF(Lønmodtager!$A49<>\"ÅÅÅ\",Lønmodtager!H49,\"\")","v":""},{"$f":"IF(Lønmodtager!$A49<>\"ÅÅÅ\",Lønmodtager!Q49,\"\")","v":""},{"$f":"IF(Lønmodtager!$A49<>\"ÅÅÅ\",Lønmodtager!R49,\"\")","v":""},{"$f":"IF(Lønmodtager!$A49<>\"ÅÅÅ\",Lønmodtager!AA49,\"\")","v":""},{"$f":"IF(Lønmodtager!$A49<>\"ÅÅÅ\",Lønmodtager!AB49,\"\")","v":""},{"$f":"IF(Lønmodtager!$A49<>\"ÅÅÅ\",Lønmodtager!AD49,\"\")","v":""},{"$f":"IF(Lønmodtager!$A49<>\"ÅÅÅ\",Lønmodtager!AC49,\"\")","v":""},{"$f":"IF(Lønmodtager!$A49<>\"ÅÅÅ\",Lønmodtager!AE49,\"\")","v":""},{"$f":"IF(Lønmodtager!$A49<>\"ÅÅÅ\",Lønmodtager!AF49,\"\")","v":""},{"$f":"IF(Lønmodtager!$A49<>\"ÅÅÅ\",Lønmodtager!AG49,\"\")","v":""},{"$f":"IF(Lønmodtager!$A49<>\"ÅÅÅ\",Lønmodtager!AK49,\"\")","v":""},{"$f":"IF(Lønmodtager!$A49<>\"ÅÅÅ\",Lønmodtager!AP49,\"\")","v":""},{"$f":"IF(Lønmodtager!$A49<>\"ÅÅÅ\",Lønmodtager!AO49,\"\")","v":""},{"$f":"IF(Lønmodtager!$A49<>\"ÅÅÅ\",Lønmodtager!AQ49,\"\")","v":""},{"$f":"IF(Lønmodtager!$A49<>\"ÅÅÅ\",Lønmodtager!AR49,\"\")","v":""}]
[{"$f":"IF(Lønmodtager!$A50<>\"ÅÅÅ\",Lønmodtager!A50,\"\")","v":""},{"$f":"IF(Lønmodtager!$A50<>\"ÅÅÅ\",Lønmodtager!F50,\"\")","v":""},{"$f":"IF(Lønmodtager!$A50<>\"ÅÅÅ\",Lønmodtager!G50,\"\")","v":""},{"$f":"IF(Lønmodtager!$A50<>\"ÅÅÅ\",Lønmodtager!H50,\"\")","v":""},{"$f":"IF(Lønmodtager!$A50<>\"ÅÅÅ\",Lønmodtager!Q50,\"\")","v":""},{"$f":"IF(Lønmodtager!$A50<>\"ÅÅÅ\",Lønmodtager!R50,\"\")","v":""},{"$f":"IF(Lønmodtager!$A50<>\"ÅÅÅ\",Lønmodtager!AA50,\"\")","v":""},{"$f":"IF(Lønmodtager!$A50<>\"ÅÅÅ\",Lønmodtager!AB50,\"\")","v":""},{"$f":"IF(Lønmodtager!$A50<>\"ÅÅÅ\",Lønmodtager!AD50,\"\")","v":""},{"$f":"IF(Lønmodtager!$A50<>\"ÅÅÅ\",Lønmodtager!AC50,\"\")","v":""},{"$f":"IF(Lønmodtager!$A50<>\"ÅÅÅ\",Lønmodtager!AE50,\"\")","v":""},{"$f":"IF(Lønmodtager!$A50<>\"ÅÅÅ\",Lønmodtager!AF50,\"\")","v":""},{"$f":"IF(Lønmodtager!$A50<>\"ÅÅÅ\",Lønmodtager!AG50,\"\")","v":""},{"$f":"IF(Lønmodtager!$A50<>\"ÅÅÅ\",Lønmodtager!AK50,\"\")","v":""},{"$f":"IF(Lønmodtager!$A50<>\"ÅÅÅ\",Lønmodtager!AP50,\"\")","v":""},{"$f":"IF(Lønmodtager!$A50<>\"ÅÅÅ\",Lønmodtager!AO50,\"\")","v":""},{"$f":"IF(Lønmodtager!$A50<>\"ÅÅÅ\",Lønmodtager!AQ50,\"\")","v":""},{"$f":"IF(Lønmodtager!$A50<>\"ÅÅÅ\",Lønmodtager!AR50,\"\")","v":""}]
[{"$f":"IF(Lønmodtager!$A51<>\"ÅÅÅ\",Lønmodtager!A51,\"\")","v":""},{"$f":"IF(Lønmodtager!$A51<>\"ÅÅÅ\",Lønmodtager!F51,\"\")","v":""},{"$f":"IF(Lønmodtager!$A51<>\"ÅÅÅ\",Lønmodtager!G51,\"\")","v":""},{"$f":"IF(Lønmodtager!$A51<>\"ÅÅÅ\",Lønmodtager!H51,\"\")","v":""},{"$f":"IF(Lønmodtager!$A51<>\"ÅÅÅ\",Lønmodtager!Q51,\"\")","v":""},{"$f":"IF(Lønmodtager!$A51<>\"ÅÅÅ\",Lønmodtager!R51,\"\")","v":""},{"$f":"IF(Lønmodtager!$A51<>\"ÅÅÅ\",Lønmodtager!AA51,\"\")","v":""},{"$f":"IF(Lønmodtager!$A51<>\"ÅÅÅ\",Lønmodtager!AB51,\"\")","v":""},{"$f":"IF(Lønmodtager!$A51<>\"ÅÅÅ\",Lønmodtager!AD51,\"\")","v":""},{"$f":"IF(Lønmodtager!$A51<>\"ÅÅÅ\",Lønmodtager!AC51,\"\")","v":""},{"$f":"IF(Lønmodtager!$A51<>\"ÅÅÅ\",Lønmodtager!AE51,\"\")","v":""},{"$f":"IF(Lønmodtager!$A51<>\"ÅÅÅ\",Lønmodtager!AF51,\"\")","v":""},{"$f":"IF(Lønmodtager!$A51<>\"ÅÅÅ\",Lønmodtager!AG51,\"\")","v":""},{"$f":"IF(Lønmodtager!$A51<>\"ÅÅÅ\",Lønmodtager!AK51,\"\")","v":""},{"$f":"IF(Lønmodtager!$A51<>\"ÅÅÅ\",Lønmodtager!AP51,\"\")","v":""},{"$f":"IF(Lønmodtager!$A51<>\"ÅÅÅ\",Lønmodtager!AO51,\"\")","v":""},{"$f":"IF(Lønmodtager!$A51<>\"ÅÅÅ\",Lønmodtager!AQ51,\"\")","v":""},{"$f":"IF(Lønmodtager!$A51<>\"ÅÅÅ\",Lønmodtager!AR51,\"\")","v":""}]
[{"$f":"IF(Lønmodtager!$A52<>\"ÅÅÅ\",Lønmodtager!A52,\"\")","v":""},{"$f":"IF(Lønmodtager!$A52<>\"ÅÅÅ\",Lønmodtager!F52,\"\")","v":""},{"$f":"IF(Lønmodtager!$A52<>\"ÅÅÅ\",Lønmodtager!G52,\"\")","v":""},{"$f":"IF(Lønmodtager!$A52<>\"ÅÅÅ\",Lønmodtager!H52,\"\")","v":""},{"$f":"IF(Lønmodtager!$A52<>\"ÅÅÅ\",Lønmodtager!Q52,\"\")","v":""},{"$f":"IF(Lønmodtager!$A52<>\"ÅÅÅ\",Lønmodtager!R52,\"\")","v":""},{"$f":"IF(Lønmodtager!$A52<>\"ÅÅÅ\",Lønmodtager!AA52,\"\")","v":""},{"$f":"IF(Lønmodtager!$A52<>\"ÅÅÅ\",Lønmodtager!AB52,\"\")","v":""},{"$f":"IF(Lønmodtager!$A52<>\"ÅÅÅ\",Lønmodtager!AD52,\"\")","v":""},{"$f":"IF(Lønmodtager!$A52<>\"ÅÅÅ\",Lønmodtager!AC52,\"\")","v":""},{"$f":"IF(Lønmodtager!$A52<>\"ÅÅÅ\",Lønmodtager!AE52,\"\")","v":""},{"$f":"IF(Lønmodtager!$A52<>\"ÅÅÅ\",Lønmodtager!AF52,\"\")","v":""},{"$f":"IF(Lønmodtager!$A52<>\"ÅÅÅ\",Lønmodtager!AG52,\"\")","v":""},{"$f":"IF(Lønmodtager!$A52<>\"ÅÅÅ\",Lønmodtager!AK52,\"\")","v":""},{"$f":"IF(Lønmodtager!$A52<>\"ÅÅÅ\",Lønmodtager!AP52,\"\")","v":""},{"$f":"IF(Lønmodtager!$A52<>\"ÅÅÅ\",Lønmodtager!AO52,\"\")","v":""},{"$f":"IF(Lønmodtager!$A52<>\"ÅÅÅ\",Lønmodtager!AQ52,\"\")","v":""},{"$f":"IF(Lønmodtager!$A52<>\"ÅÅÅ\",Lønmodtager!AR52,\"\")","v":""}]
[{"$f":"IF(Lønmodtager!$A53<>\"ÅÅÅ\",Lønmodtager!A53,\"\")","v":""},{"$f":"IF(Lønmodtager!$A53<>\"ÅÅÅ\",Lønmodtager!F53,\"\")","v":""},{"$f":"IF(Lønmodtager!$A53<>\"ÅÅÅ\",Lønmodtager!G53,\"\")","v":""},{"$f":"IF(Lønmodtager!$A53<>\"ÅÅÅ\",Lønmodtager!H53,\"\")","v":""},{"$f":"IF(Lønmodtager!$A53<>\"ÅÅÅ\",Lønmodtager!Q53,\"\")","v":""},{"$f":"IF(Lønmodtager!$A53<>\"ÅÅÅ\",Lønmodtager!R53,\"\")","v":""},{"$f":"IF(Lønmodtager!$A53<>\"ÅÅÅ\",Lønmodtager!AA53,\"\")","v":""},{"$f":"IF(Lønmodtager!$A53<>\"ÅÅÅ\",Lønmodtager!AB53,\"\")","v":""},{"$f":"IF(Lønmodtager!$A53<>\"ÅÅÅ\",Lønmodtager!AD53,\"\")","v":""},{"$f":"IF(Lønmodtager!$A53<>\"ÅÅÅ\",Lønmodtager!AC53,\"\")","v":""},{"$f":"IF(Lønmodtager!$A53<>\"ÅÅÅ\",Lønmodtager!AE53,\"\")","v":""},{"$f":"IF(Lønmodtager!$A53<>\"ÅÅÅ\",Lønmodtager!AF53,\"\")","v":""},{"$f":"IF(Lønmodtager!$A53<>\"ÅÅÅ\",Lønmodtager!AG53,\"\")","v":""},{"$f":"IF(Lønmodtager!$A53<>\"ÅÅÅ\",Lønmodtager!AK53,\"\")","v":""},{"$f":"IF(Lønmodtager!$A53<>\"ÅÅÅ\",Lønmodtager!AP53,\"\")","v":""},{"$f":"IF(Lønmodtager!$A53<>\"ÅÅÅ\",Lønmodtager!AL53,\"\")","v":""},{"$f":"IF(Lønmodtager!$A53<>\"ÅÅÅ\",Lønmodtager!AQ53,\"\")","v":""},{"$f":"IF(Lønmodtager!$A53<>\"ÅÅÅ\",Lønmodtager!AR53,\"\")","v":""}]
[{"$f":"IF(Lønmodtager!$A54<>\"ÅÅÅ\",Lønmodtager!A54,\"\")","v":""},{"$f":"IF(Lønmodtager!$A54<>\"ÅÅÅ\",Lønmodtager!F54,\"\")","v":""},{"$f":"IF(Lønmodtager!$A54<>\"ÅÅÅ\",Lønmodtager!G54,\"\")","v":""},{"$f":"IF(Lønmodtager!$A54<>\"ÅÅÅ\",Lønmodtager!H54,\"\")","v":""},{"$f":"IF(Lønmodtager!$A54<>\"ÅÅÅ\",Lønmodtager!Q54,\"\")","v":""},{"$f":"IF(Lønmodtager!$A54<>\"ÅÅÅ\",Lønmodtager!R54,\"\")","v":""},{"$f":"IF(Lønmodtager!$A54<>\"ÅÅÅ\",Lønmodtager!AA54,\"\")","v":""},{"$f":"IF(Lønmodtager!$A54<>\"ÅÅÅ\",Lønmodtager!AB54,\"\")","v":""},{"$f":"IF(Lønmodtager!$A54<>\"ÅÅÅ\",Lønmodtager!AD54,\"\")","v":""},{"$f":"IF(Lønmodtager!$A54<>\"ÅÅÅ\",Lønmodtager!AC54,\"\")","v":""},{"$f":"IF(Lønmodtager!$A54<>\"ÅÅÅ\",Lønmodtager!AE54,\"\")","v":""},{"$f":"IF(Lønmodtager!$A54<>\"ÅÅÅ\",Lønmodtager!AF54,\"\")","v":""},{"$f":"IF(Lønmodtager!$A54<>\"ÅÅÅ\",Lønmodtager!AG54,\"\")","v":""},{"$f":"IF(Lønmodtager!$A54<>\"ÅÅÅ\",Lønmodtager!AK54,\"\")","v":""},{"$f":"IF(Lønmodtager!$A54<>\"ÅÅÅ\",Lønmodtager!AP54,\"\")","v":""},{"$f":"IF(Lønmodtager!$A54<>\"ÅÅÅ\",Lønmodtager!AL54,\"\")","v":""},{"$f":"IF(Lønmodtager!$A54<>\"ÅÅÅ\",Lønmodtager!AQ54,\"\")","v":""},{"$f":"IF(Lønmodtager!$A54<>\"ÅÅÅ\",Lønmodtager!AR54,\"\")","v":""}]
[{"$f":"IF(Lønmodtager!$A55<>\"ÅÅÅ\",Lønmodtager!A55,\"\")","v":""},{"$f":"IF(Lønmodtager!$A55<>\"ÅÅÅ\",Lønmodtager!F55,\"\")","v":""},{"$f":"IF(Lønmodtager!$A55<>\"ÅÅÅ\",Lønmodtager!G55,\"\")","v":""},{"$f":"IF(Lønmodtager!$A55<>\"ÅÅÅ\",Lønmodtager!H55,\"\")","v":""},{"$f":"IF(Lønmodtager!$A55<>\"ÅÅÅ\",Lønmodtager!Q55,\"\")","v":""},{"$f":"IF(Lønmodtager!$A55<>\"ÅÅÅ\",Lønmodtager!R55,\"\")","v":""},{"$f":"IF(Lønmodtager!$A55<>\"ÅÅÅ\",Lønmodtager!AA55,\"\")","v":""},{"$f":"IF(Lønmodtager!$A55<>\"ÅÅÅ\",Lønmodtager!AB55,\"\")","v":""},{"$f":"IF(Lønmodtager!$A55<>\"ÅÅÅ\",Lønmodtager!AD55,\"\")","v":""},{"$f":"IF(Lønmodtager!$A55<>\"ÅÅÅ\",Lønmodtager!AC55,\"\")","v":""},{"$f":"IF(Lønmodtager!$A55<>\"ÅÅÅ\",Lønmodtager!AE55,\"\")","v":""},{"$f":"IF(Lønmodtager!$A55<>\"ÅÅÅ\",Lønmodtager!AF55,\"\")","v":""},{"$f":"IF(Lønmodtager!$A55<>\"ÅÅÅ\",Lønmodtager!AG55,\"\")","v":""},{"$f":"IF(Lønmodtager!$A55<>\"ÅÅÅ\",Lønmodtager!AK55,\"\")","v":""},{"$f":"IF(Lønmodtager!$A55<>\"ÅÅÅ\",Lønmodtager!AP55,\"\")","v":""},{"$f":"IF(Lønmodtager!$A55<>\"ÅÅÅ\",Lønmodtager!AL55,\"\")","v":""},{"$f":"IF(Lønmodtager!$A55<>\"ÅÅÅ\",Lønmodtager!AQ55,\"\")","v":""},{"$f":"IF(Lønmodtager!$A55<>\"ÅÅÅ\",Lønmodtager!AR55,\"\")","v":""}]
[{"$f":"IF(Lønmodtager!$A56<>\"ÅÅÅ\",Lønmodtager!A56,\"\")","v":""},{"$f":"IF(Lønmodtager!$A56<>\"ÅÅÅ\",Lønmodtager!F56,\"\")","v":""},{"$f":"IF(Lønmodtager!$A56<>\"ÅÅÅ\",Lønmodtager!G56,\"\")","v":""},{"$f":"IF(Lønmodtager!$A56<>\"ÅÅÅ\",Lønmodtager!H56,\"\")","v":""},{"$f":"IF(Lønmodtager!$A56<>\"ÅÅÅ\",Lønmodtager!Q56,\"\")","v":""},{"$f":"IF(Lønmodtager!$A56<>\"ÅÅÅ\",Lønmodtager!R56,\"\")","v":""},{"$f":"IF(Lønmodtager!$A56<>\"ÅÅÅ\",Lønmodtager!AA56,\"\")","v":""},{"$f":"IF(Lønmodtager!$A56<>\"ÅÅÅ\",Lønmodtager!AB56,\"\")","v":""},{"$f":"IF(Lønmodtager!$A56<>\"ÅÅÅ\",Lønmodtager!AD56,\"\")","v":""},{"$f":"IF(Lønmodtager!$A56<>\"ÅÅÅ\",Lønmodtager!AC56,\"\")","v":""},{"$f":"IF(Lønmodtager!$A56<>\"ÅÅÅ\",Lønmodtager!AE56,\"\")","v":""},{"$f":"IF(Lønmodtager!$A56<>\"ÅÅÅ\",Lønmodtager!AF56,\"\")","v":""},{"$f":"IF(Lønmodtager!$A56<>\"ÅÅÅ\",Lønmodtager!AG56,\"\")","v":""},{"$f":"IF(Lønmodtager!$A56<>\"ÅÅÅ\",Lønmodtager!AK56,\"\")","v":""},{"$f":"IF(Lønmodtager!$A56<>\"ÅÅÅ\",Lønmodtager!AP56,\"\")","v":""},{"$f":"IF(Lønmodtager!$A56<>\"ÅÅÅ\",Lønmodtager!AL56,\"\")","v":""},{"$f":"IF(Lønmodtager!$A56<>\"ÅÅÅ\",Lønmodtager!AQ56,\"\")","v":""},{"$f":"IF(Lønmodtager!$A56<>\"ÅÅÅ\",Lønmodtager!AR56,\"\")","v":""}]
[{"$f":"IF(Lønmodtager!$A57<>\"ÅÅÅ\",Lønmodtager!A57,\"\")","v":""},{"$f":"IF(Lønmodtager!$A57<>\"ÅÅÅ\",Lønmodtager!F57,\"\")","v":""},{"$f":"IF(Lønmodtager!$A57<>\"ÅÅÅ\",Lønmodtager!G57,\"\")","v":""},{"$f":"IF(Lønmodtager!$A57<>\"ÅÅÅ\",Lønmodtager!H57,\"\")","v":""},{"$f":"IF(Lønmodtager!$A57<>\"ÅÅÅ\",Lønmodtager!Q57,\"\")","v":""},{"$f":"IF(Lønmodtager!$A57<>\"ÅÅÅ\",Lønmodtager!R57,\"\")","v":""},{"$f":"IF(Lønmodtager!$A57<>\"ÅÅÅ\",Lønmodtager!AA57,\"\")","v":""},{"$f":"IF(Lønmodtager!$A57<>\"ÅÅÅ\",Lønmodtager!AB57,\"\")","v":""},{"$f":"IF(Lønmodtager!$A57<>\"ÅÅÅ\",Lønmodtager!AD57,\"\")","v":""},{"$f":"IF(Lønmodtager!$A57<>\"ÅÅÅ\",Lønmodtager!AC57,\"\")","v":""},{"$f":"IF(Lønmodtager!$A57<>\"ÅÅÅ\",Lønmodtager!AE57,\"\")","v":""},{"$f":"IF(Lønmodtager!$A57<>\"ÅÅÅ\",Lønmodtager!AF57,\"\")","v":""},{"$f":"IF(Lønmodtager!$A57<>\"ÅÅÅ\",Lønmodtager!AG57,\"\")","v":""},{"$f":"IF(Lønmodtager!$A57<>\"ÅÅÅ\",Lønmodtager!AK57,\"\")","v":""},{"$f":"IF(Lønmodtager!$A57<>\"ÅÅÅ\",Lønmodtager!AP57,\"\")","v":""},{"$f":"IF(Lønmodtager!$A57<>\"ÅÅÅ\",Lønmodtager!AL57,\"\")","v":""},{"$f":"IF(Lønmodtager!$A57<>\"ÅÅÅ\",Lønmodtager!AQ57,\"\")","v":""},{"$f":"IF(Lønmodtager!$A57<>\"ÅÅÅ\",Lønmodtager!AR57,\"\")","v":""}]
[{"$f":"IF(Lønmodtager!$A58<>\"ÅÅÅ\",Lønmodtager!A58,\"\")","v":""},{"$f":"IF(Lønmodtager!$A58<>\"ÅÅÅ\",Lønmodtager!F58,\"\")","v":""},{"$f":"IF(Lønmodtager!$A58<>\"ÅÅÅ\",Lønmodtager!G58,\"\")","v":""},{"$f":"IF(Lønmodtager!$A58<>\"ÅÅÅ\",Lønmodtager!H58,\"\")","v":""},{"$f":"IF(Lønmodtager!$A58<>\"ÅÅÅ\",Lønmodtager!Q58,\"\")","v":""},{"$f":"IF(Lønmodtager!$A58<>\"ÅÅÅ\",Lønmodtager!R58,\"\")","v":""},{"$f":"IF(Lønmodtager!$A58<>\"ÅÅÅ\",Lønmodtager!AA58,\"\")","v":""},{"$f":"IF(Lønmodtager!$A58<>\"ÅÅÅ\",Lønmodtager!AB58,\"\")","v":""},{"$f":"IF(Lønmodtager!$A58<>\"ÅÅÅ\",Lønmodtager!AD58,\"\")","v":""},{"$f":"IF(Lønmodtager!$A58<>\"ÅÅÅ\",Lønmodtager!AC58,\"\")","v":""},{"$f":"IF(Lønmodtager!$A58<>\"ÅÅÅ\",Lønmodtager!AE58,\"\")","v":""},{"$f":"IF(Lønmodtager!$A58<>\"ÅÅÅ\",Lønmodtager!AF58,\"\")","v":""},{"$f":"IF(Lønmodtager!$A58<>\"ÅÅÅ\",Lønmodtager!AG58,\"\")","v":""},{"$f":"IF(Lønmodtager!$A58<>\"ÅÅÅ\",Lønmodtager!AK58,\"\")","v":""},{"$f":"IF(Lønmodtager!$A58<>\"ÅÅÅ\",Lønmodtager!AP58,\"\")","v":""},{"$f":"IF(Lønmodtager!$A58<>\"ÅÅÅ\",Lønmodtager!AL58,\"\")","v":""},{"$f":"IF(Lønmodtager!$A58<>\"ÅÅÅ\",Lønmodtager!AQ58,\"\")","v":""},{"$f":"IF(Lønmodtager!$A58<>\"ÅÅÅ\",Lønmodtager!AR58,\"\")","v":""}]
[{"$f":"IF(Lønmodtager!$A59<>\"ÅÅÅ\",Lønmodtager!A59,\"\")","v":""},{"$f":"IF(Lønmodtager!$A59<>\"ÅÅÅ\",Lønmodtager!F59,\"\")","v":""},{"$f":"IF(Lønmodtager!$A59<>\"ÅÅÅ\",Lønmodtager!G59,\"\")","v":""},{"$f":"IF(Lønmodtager!$A59<>\"ÅÅÅ\",Lønmodtager!H59,\"\")","v":""},{"$f":"IF(Lønmodtager!$A59<>\"ÅÅÅ\",Lønmodtager!Q59,\"\")","v":""},{"$f":"IF(Lønmodtager!$A59<>\"ÅÅÅ\",Lønmodtager!R59,\"\")","v":""},{"$f":"IF(Lønmodtager!$A59<>\"ÅÅÅ\",Lønmodtager!AA59,\"\")","v":""},{"$f":"IF(Lønmodtager!$A59<>\"ÅÅÅ\",Lønmodtager!AB59,\"\")","v":""},{"$f":"IF(Lønmodtager!$A59<>\"ÅÅÅ\",Lønmodtager!AD59,\"\")","v":""},{"$f":"IF(Lønmodtager!$A59<>\"ÅÅÅ\",Lønmodtager!AC59,\"\")","v":""},{"$f":"IF(Lønmodtager!$A59<>\"ÅÅÅ\",Lønmodtager!AE59,\"\")","v":""},{"$f":"IF(Lønmodtager!$A59<>\"ÅÅÅ\",Lønmodtager!AF59,\"\")","v":""},{"$f":"IF(Lønmodtager!$A59<>\"ÅÅÅ\",Lønmodtager!AG59,\"\")","v":""},{"$f":"IF(Lønmodtager!$A59<>\"ÅÅÅ\",Lønmodtager!AK59,\"\")","v":""},{"$f":"IF(Lønmodtager!$A59<>\"ÅÅÅ\",Lønmodtager!AP59,\"\")","v":""},{"$f":"IF(Lønmodtager!$A59<>\"ÅÅÅ\",Lønmodtager!AL59,\"\")","v":""},{"$f":"IF(Lønmodtager!$A59<>\"ÅÅÅ\",Lønmodtager!AQ59,\"\")","v":""},{"$f":"IF(Lønmodtager!$A59<>\"ÅÅÅ\",Lønmodtager!AR59,\"\")","v":""}]
[{"$f":"IF(Lønmodtager!$A60<>\"ÅÅÅ\",Lønmodtager!A60,\"\")","v":""},{"$f":"IF(Lønmodtager!$A60<>\"ÅÅÅ\",Lønmodtager!F60,\"\")","v":""},{"$f":"IF(Lønmodtager!$A60<>\"ÅÅÅ\",Lønmodtager!G60,\"\")","v":""},{"$f":"IF(Lønmodtager!$A60<>\"ÅÅÅ\",Lønmodtager!H60,\"\")","v":""},{"$f":"IF(Lønmodtager!$A60<>\"ÅÅÅ\",Lønmodtager!Q60,\"\")","v":""},{"$f":"IF(Lønmodtager!$A60<>\"ÅÅÅ\",Lønmodtager!R60,\"\")","v":""},{"$f":"IF(Lønmodtager!$A60<>\"ÅÅÅ\",Lønmodtager!AA60,\"\")","v":""},{"$f":"IF(Lønmodtager!$A60<>\"ÅÅÅ\",Lønmodtager!AB60,\"\")","v":""},{"$f":"IF(Lønmodtager!$A60<>\"ÅÅÅ\",Lønmodtager!AD60,\"\")","v":""},{"$f":"IF(Lønmodtager!$A60<>\"ÅÅÅ\",Lønmodtager!AC60,\"\")","v":""},{"$f":"IF(Lønmodtager!$A60<>\"ÅÅÅ\",Lønmodtager!AE60,\"\")","v":""},{"$f":"IF(Lønmodtager!$A60<>\"ÅÅÅ\",Lønmodtager!AF60,\"\")","v":""},{"$f":"IF(Lønmodtager!$A60<>\"ÅÅÅ\",Lønmodtager!AG60,\"\")","v":""},{"$f":"IF(Lønmodtager!$A60<>\"ÅÅÅ\",Lønmodtager!AK60,\"\")","v":""},{"$f":"IF(Lønmodtager!$A60<>\"ÅÅÅ\",Lønmodtager!AP60,\"\")","v":""},{"$f":"IF(Lønmodtager!$A60<>\"ÅÅÅ\",Lønmodtager!AL60,\"\")","v":""},{"$f":"IF(Lønmodtager!$A60<>\"ÅÅÅ\",Lønmodtager!AQ60,\"\")","v":""},{"$f":"IF(Lønmodtager!$A60<>\"ÅÅÅ\",Lønmodtager!AR60,\"\")","v":""}]
[{"$f":"IF(Lønmodtager!$A61<>\"ÅÅÅ\",Lønmodtager!A61,\"\")","v":""},{"$f":"IF(Lønmodtager!$A61<>\"ÅÅÅ\",Lønmodtager!F61,\"\")","v":""},{"$f":"IF(Lønmodtager!$A61<>\"ÅÅÅ\",Lønmodtager!G61,\"\")","v":""},{"$f":"IF(Lønmodtager!$A61<>\"ÅÅÅ\",Lønmodtager!H61,\"\")","v":""},{"$f":"IF(Lønmodtager!$A61<>\"ÅÅÅ\",Lønmodtager!Q61,\"\")","v":""},{"$f":"IF(Lønmodtager!$A61<>\"ÅÅÅ\",Lønmodtager!R61,\"\")","v":""},{"$f":"IF(Lønmodtager!$A61<>\"ÅÅÅ\",Lønmodtager!AA61,\"\")","v":""},{"$f":"IF(Lønmodtager!$A61<>\"ÅÅÅ\",Lønmodtager!AB61,\"\")","v":""},{"$f":"IF(Lønmodtager!$A61<>\"ÅÅÅ\",Lønmodtager!AD61,\"\")","v":""},{"$f":"IF(Lønmodtager!$A61<>\"ÅÅÅ\",Lønmodtager!AC61,\"\")","v":""},{"$f":"IF(Lønmodtager!$A61<>\"ÅÅÅ\",Lønmodtager!AE61,\"\")","v":""},{"$f":"IF(Lønmodtager!$A61<>\"ÅÅÅ\",Lønmodtager!AF61,\"\")","v":""},{"$f":"IF(Lønmodtager!$A61<>\"ÅÅÅ\",Lønmodtager!AG61,\"\")","v":""},{"$f":"IF(Lønmodtager!$A61<>\"ÅÅÅ\",Lønmodtager!AK61,\"\")","v":""},{"$f":"IF(Lønmodtager!$A61<>\"ÅÅÅ\",Lønmodtager!AP61,\"\")","v":""},{"$f":"IF(Lønmodtager!$A61<>\"ÅÅÅ\",Lønmodtager!AL61,\"\")","v":""},{"$f":"IF(Lønmodtager!$A61<>\"ÅÅÅ\",Lønmodtager!AQ61,\"\")","v":""},{"$f":"IF(Lønmodtager!$A61<>\"ÅÅÅ\",Lønmodtager!AR61,\"\")","v":""}]
[{"$f":"IF(Lønmodtager!$A62<>\"ÅÅÅ\",Lønmodtager!A62,\"\")","v":""},{"$f":"IF(Lønmodtager!$A62<>\"ÅÅÅ\",Lønmodtager!F62,\"\")","v":""},{"$f":"IF(Lønmodtager!$A62<>\"ÅÅÅ\",Lønmodtager!G62,\"\")","v":""},{"$f":"IF(Lønmodtager!$A62<>\"ÅÅÅ\",Lønmodtager!H62,\"\")","v":""},{"$f":"IF(Lønmodtager!$A62<>\"ÅÅÅ\",Lønmodtager!Q62,\"\")","v":""},{"$f":"IF(Lønmodtager!$A62<>\"ÅÅÅ\",Lønmodtager!R62,\"\")","v":""},{"$f":"IF(Lønmodtager!$A62<>\"ÅÅÅ\",Lønmodtager!AA62,\"\")","v":""},{"$f":"IF(Lønmodtager!$A62<>\"ÅÅÅ\",Lønmodtager!AB62,\"\")","v":""},{"$f":"IF(Lønmodtager!$A62<>\"ÅÅÅ\",Lønmodtager!AD62,\"\")","v":""},{"$f":"IF(Lønmodtager!$A62<>\"ÅÅÅ\",Lønmodtager!AC62,\"\")","v":""},{"$f":"IF(Lønmodtager!$A62<>\"ÅÅÅ\",Lønmodtager!AE62,\"\")","v":""},{"$f":"IF(Lønmodtager!$A62<>\"ÅÅÅ\",Lønmodtager!AF62,\"\")","v":""},{"$f":"IF(Lønmodtager!$A62<>\"ÅÅÅ\",Lønmodtager!AG62,\"\")","v":""},{"$f":"IF(Lønmodtager!$A62<>\"ÅÅÅ\",Lønmodtager!AK62,\"\")","v":""},{"$f":"IF(Lønmodtager!$A62<>\"ÅÅÅ\",Lønmodtager!AP62,\"\")","v":""},{"$f":"IF(Lønmodtager!$A62<>\"ÅÅÅ\",Lønmodtager!AL62,\"\")","v":""},{"$f":"IF(Lønmodtager!$A62<>\"ÅÅÅ\",Lønmodtager!AQ62,\"\")","v":""},{"$f":"IF(Lønmodtager!$A62<>\"ÅÅÅ\",Lønmodtager!AR62,\"\")","v":""}]
[{"$f":"IF(Lønmodtager!$A63<>\"ÅÅÅ\",Lønmodtager!A63,\"\")","v":""},{"$f":"IF(Lønmodtager!$A63<>\"ÅÅÅ\",Lønmodtager!F63,\"\")","v":""},{"$f":"IF(Lønmodtager!$A63<>\"ÅÅÅ\",Lønmodtager!G63,\"\")","v":""},{"$f":"IF(Lønmodtager!$A63<>\"ÅÅÅ\",Lønmodtager!H63,\"\")","v":""},{"$f":"IF(Lønmodtager!$A63<>\"ÅÅÅ\",Lønmodtager!Q63,\"\")","v":""},{"$f":"IF(Lønmodtager!$A63<>\"ÅÅÅ\",Lønmodtager!R63,\"\")","v":""},{"$f":"IF(Lønmodtager!$A63<>\"ÅÅÅ\",Lønmodtager!AA63,\"\")","v":""},{"$f":"IF(Lønmodtager!$A63<>\"ÅÅÅ\",Lønmodtager!AB63,\"\")","v":""},{"$f":"IF(Lønmodtager!$A63<>\"ÅÅÅ\",Lønmodtager!AD63,\"\")","v":""},{"$f":"IF(Lønmodtager!$A63<>\"ÅÅÅ\",Lønmodtager!AC63,\"\")","v":""},{"$f":"IF(Lønmodtager!$A63<>\"ÅÅÅ\",Lønmodtager!AE63,\"\")","v":""},{"$f":"IF(Lønmodtager!$A63<>\"ÅÅÅ\",Lønmodtager!AF63,\"\")","v":""},{"$f":"IF(Lønmodtager!$A63<>\"ÅÅÅ\",Lønmodtager!AG63,\"\")","v":""},{"$f":"IF(Lønmodtager!$A63<>\"ÅÅÅ\",Lønmodtager!AK63,\"\")","v":""},{"$f":"IF(Lønmodtager!$A63<>\"ÅÅÅ\",Lønmodtager!AP63,\"\")","v":""},{"$f":"IF(Lønmodtager!$A63<>\"ÅÅÅ\",Lønmodtager!AL63,\"\")","v":""},{"$f":"IF(Lønmodtager!$A63<>\"ÅÅÅ\",Lønmodtager!AQ63,\"\")","v":""},{"$f":"IF(Lønmodtager!$A63<>\"ÅÅÅ\",Lønmodtager!AR63,\"\")","v":""}]
[{"$f":"IF(Lønmodtager!$A64<>\"ÅÅÅ\",Lønmodtager!A64,\"\")","v":""},{"$f":"IF(Lønmodtager!$A64<>\"ÅÅÅ\",Lønmodtager!F64,\"\")","v":""},{"$f":"IF(Lønmodtager!$A64<>\"ÅÅÅ\",Lønmodtager!G64,\"\")","v":""},{"$f":"IF(Lønmodtager!$A64<>\"ÅÅÅ\",Lønmodtager!H64,\"\")","v":""},{"$f":"IF(Lønmodtager!$A64<>\"ÅÅÅ\",Lønmodtager!Q64,\"\")","v":""},{"$f":"IF(Lønmodtager!$A64<>\"ÅÅÅ\",Lønmodtager!R64,\"\")","v":""},{"$f":"IF(Lønmodtager!$A64<>\"ÅÅÅ\",Lønmodtager!AA64,\"\")","v":""},{"$f":"IF(Lønmodtager!$A64<>\"ÅÅÅ\",Lønmodtager!AB64,\"\")","v":""},{"$f":"IF(Lønmodtager!$A64<>\"ÅÅÅ\",Lønmodtager!AD64,\"\")","v":""},{"$f":"IF(Lønmodtager!$A64<>\"ÅÅÅ\",Lønmodtager!AC64,\"\")","v":""},{"$f":"IF(Lønmodtager!$A64<>\"ÅÅÅ\",Lønmodtager!AE64,\"\")","v":""},{"$f":"IF(Lønmodtager!$A64<>\"ÅÅÅ\",Lønmodtager!AF64,\"\")","v":""},{"$f":"IF(Lønmodtager!$A64<>\"ÅÅÅ\",Lønmodtager!AG64,\"\")","v":""},{"$f":"IF(Lønmodtager!$A64<>\"ÅÅÅ\",Lønmodtager!AK64,\"\")","v":""},{"$f":"IF(Lønmodtager!$A64<>\"ÅÅÅ\",Lønmodtager!AP64,\"\")","v":""},{"$f":"IF(Lønmodtager!$A64<>\"ÅÅÅ\",Lønmodtager!AL64,\"\")","v":""},{"$f":"IF(Lønmodtager!$A64<>\"ÅÅÅ\",Lønmodtager!AQ64,\"\")","v":""},{"$f":"IF(Lønmodtager!$A64<>\"ÅÅÅ\",Lønmodtager!AR64,\"\")","v":""}]
[{"$f":"IF(Lønmodtager!$A65<>\"ÅÅÅ\",Lønmodtager!A65,\"\")","v":""},{"$f":"IF(Lønmodtager!$A65<>\"ÅÅÅ\",Lønmodtager!F65,\"\")","v":""},{"$f":"IF(Lønmodtager!$A65<>\"ÅÅÅ\",Lønmodtager!G65,\"\")","v":""},{"$f":"IF(Lønmodtager!$A65<>\"ÅÅÅ\",Lønmodtager!H65,\"\")","v":""},{"$f":"IF(Lønmodtager!$A65<>\"ÅÅÅ\",Lønmodtager!Q65,\"\")","v":""},{"$f":"IF(Lønmodtager!$A65<>\"ÅÅÅ\",Lønmodtager!R65,\"\")","v":""},{"$f":"IF(Lønmodtager!$A65<>\"ÅÅÅ\",Lønmodtager!AA65,\"\")","v":""},{"$f":"IF(Lønmodtager!$A65<>\"ÅÅÅ\",Lønmodtager!AB65,\"\")","v":""},{"$f":"IF(Lønmodtager!$A65<>\"ÅÅÅ\",Lønmodtager!AD65,\"\")","v":""},{"$f":"IF(Lønmodtager!$A65<>\"ÅÅÅ\",Lønmodtager!AC65,\"\")","v":""},{"$f":"IF(Lønmodtager!$A65<>\"ÅÅÅ\",Lønmodtager!AE65,\"\")","v":""},{"$f":"IF(Lønmodtager!$A65<>\"ÅÅÅ\",Lønmodtager!AF65,\"\")","v":""},{"$f":"IF(Lønmodtager!$A65<>\"ÅÅÅ\",Lønmodtager!AG65,\"\")","v":""},{"$f":"IF(Lønmodtager!$A65<>\"ÅÅÅ\",Lønmodtager!AK65,\"\")","v":""},{"$f":"IF(Lønmodtager!$A65<>\"ÅÅÅ\",Lønmodtager!AP65,\"\")","v":""},{"$f":"IF(Lønmodtager!$A65<>\"ÅÅÅ\",Lønmodtager!AL65,\"\")","v":""},{"$f":"IF(Lønmodtager!$A65<>\"ÅÅÅ\",Lønmodtager!AQ65,\"\")","v":""},{"$f":"IF(Lønmodtager!$A65<>\"ÅÅÅ\",Lønmodtager!AR65,\"\")","v":""}]
[{"$f":"IF(Lønmodtager!$A66<>\"ÅÅÅ\",Lønmodtager!A66,\"\")","v":""},{"$f":"IF(Lønmodtager!$A66<>\"ÅÅÅ\",Lønmodtager!F66,\"\")","v":""},{"$f":"IF(Lønmodtager!$A66<>\"ÅÅÅ\",Lønmodtager!G66,\"\")","v":""},{"$f":"IF(Lønmodtager!$A66<>\"ÅÅÅ\",Lønmodtager!H66,\"\")","v":""},{"$f":"IF(Lønmodtager!$A66<>\"ÅÅÅ\",Lønmodtager!Q66,\"\")","v":""},{"$f":"IF(Lønmodtager!$A66<>\"ÅÅÅ\",Lønmodtager!R66,\"\")","v":""},{"$f":"IF(Lønmodtager!$A66<>\"ÅÅÅ\",Lønmodtager!AA66,\"\")","v":""},{"$f":"IF(Lønmodtager!$A66<>\"ÅÅÅ\",Lønmodtager!AB66,\"\")","v":""},{"$f":"IF(Lønmodtager!$A66<>\"ÅÅÅ\",Lønmodtager!AD66,\"\")","v":""},{"$f":"IF(Lønmodtager!$A66<>\"ÅÅÅ\",Lønmodtager!AC66,\"\")","v":""},{"$f":"IF(Lønmodtager!$A66<>\"ÅÅÅ\",Lønmodtager!AE66,\"\")","v":""},{"$f":"IF(Lønmodtager!$A66<>\"ÅÅÅ\",Lønmodtager!AF66,\"\")","v":""},{"$f":"IF(Lønmodtager!$A66<>\"ÅÅÅ\",Lønmodtager!AG66,\"\")","v":""},{"$f":"IF(Lønmodtager!$A66<>\"ÅÅÅ\",Lønmodtager!AK66,\"\")","v":""},{"$f":"IF(Lønmodtager!$A66<>\"ÅÅÅ\",Lønmodtager!AP66,\"\")","v":""},{"$f":"IF(Lønmodtager!$A66<>\"ÅÅÅ\",Lønmodtager!AL66,\"\")","v":""},{"$f":"IF(Lønmodtager!$A66<>\"ÅÅÅ\",Lønmodtager!AQ66,\"\")","v":""},{"$f":"IF(Lønmodtager!$A66<>\"ÅÅÅ\",Lønmodtager!AR66,\"\")","v":""}]
[{"$f":"IF(Lønmodtager!$A67<>\"ÅÅÅ\",Lønmodtager!A67,\"\")","v":""},{"$f":"IF(Lønmodtager!$A67<>\"ÅÅÅ\",Lønmodtager!F67,\"\")","v":""},{"$f":"IF(Lønmodtager!$A67<>\"ÅÅÅ\",Lønmodtager!G67,\"\")","v":""},{"$f":"IF(Lønmodtager!$A67<>\"ÅÅÅ\",Lønmodtager!H67,\"\")","v":""},{"$f":"IF(Lønmodtager!$A67<>\"ÅÅÅ\",Lønmodtager!Q67,\"\")","v":""},{"$f":"IF(Lønmodtager!$A67<>\"ÅÅÅ\",Lønmodtager!R67,\"\")","v":""},{"$f":"IF(Lønmodtager!$A67<>\"ÅÅÅ\",Lønmodtager!AA67,\"\")","v":""},{"$f":"IF(Lønmodtager!$A67<>\"ÅÅÅ\",Lønmodtager!AB67,\"\")","v":""},{"$f":"IF(Lønmodtager!$A67<>\"ÅÅÅ\",Lønmodtager!AD67,\"\")","v":""},{"$f":"IF(Lønmodtager!$A67<>\"ÅÅÅ\",Lønmodtager!AC67,\"\")","v":""},{"$f":"IF(Lønmodtager!$A67<>\"ÅÅÅ\",Lønmodtager!AE67,\"\")","v":""},{"$f":"IF(Lønmodtager!$A67<>\"ÅÅÅ\",Lønmodtager!AF67,\"\")","v":""},{"$f":"IF(Lønmodtager!$A67<>\"ÅÅÅ\",Lønmodtager!AG67,\"\")","v":""},{"$f":"IF(Lønmodtager!$A67<>\"ÅÅÅ\",Lønmodtager!AK67,\"\")","v":""},{"$f":"IF(Lønmodtager!$A67<>\"ÅÅÅ\",Lønmodtager!AP67,\"\")","v":""},{"$f":"IF(Lønmodtager!$A67<>\"ÅÅÅ\",Lønmodtager!AL67,\"\")","v":""},{"$f":"IF(Lønmodtager!$A67<>\"ÅÅÅ\",Lønmodtager!AQ67,\"\")","v":""},{"$f":"IF(Lønmodtager!$A67<>\"ÅÅÅ\",Lønmodtager!AR67,\"\")","v":""}]
[{"$f":"IF(Lønmodtager!$A68<>\"ÅÅÅ\",Lønmodtager!A68,\"\")","v":""},{"$f":"IF(Lønmodtager!$A68<>\"ÅÅÅ\",Lønmodtager!F68,\"\")","v":""},{"$f":"IF(Lønmodtager!$A68<>\"ÅÅÅ\",Lønmodtager!G68,\"\")","v":""},{"$f":"IF(Lønmodtager!$A68<>\"ÅÅÅ\",Lønmodtager!H68,\"\")","v":""},{"$f":"IF(Lønmodtager!$A68<>\"ÅÅÅ\",Lønmodtager!Q68,\"\")","v":""},{"$f":"IF(Lønmodtager!$A68<>\"ÅÅÅ\",Lønmodtager!R68,\"\")","v":""},{"$f":"IF(Lønmodtager!$A68<>\"ÅÅÅ\",Lønmodtager!AA68,\"\")","v":""},{"$f":"IF(Lønmodtager!$A68<>\"ÅÅÅ\",Lønmodtager!AB68,\"\")","v":""},{"$f":"IF(Lønmodtager!$A68<>\"ÅÅÅ\",Lønmodtager!AD68,\"\")","v":""},{"$f":"IF(Lønmodtager!$A68<>\"ÅÅÅ\",Lønmodtager!AC68,\"\")","v":""},{"$f":"IF(Lønmodtager!$A68<>\"ÅÅÅ\",Lønmodtager!AE68,\"\")","v":""},{"$f":"IF(Lønmodtager!$A68<>\"ÅÅÅ\",Lønmodtager!AF68,\"\")","v":""},{"$f":"IF(Lønmodtager!$A68<>\"ÅÅÅ\",Lønmodtager!AG68,\"\")","v":""},{"$f":"IF(Lønmodtager!$A68<>\"ÅÅÅ\",Lønmodtager!AK68,\"\")","v":""},{"$f":"IF(Lønmodtager!$A68<>\"ÅÅÅ\",Lønmodtager!AP68,\"\")","v":""},{"$f":"IF(Lønmodtager!$A68<>\"ÅÅÅ\",Lønmodtager!AL68,\"\")","v":""},{"$f":"IF(Lønmodtager!$A68<>\"ÅÅÅ\",Lønmodtager!AQ68,\"\")","v":""},{"$f":"IF(Lønmodtager!$A68<>\"ÅÅÅ\",Lønmodtager!AR68,\"\")","v":""}]
[{"$f":"IF(Lønmodtager!$A69<>\"ÅÅÅ\",Lønmodtager!A69,\"\")","v":""},{"$f":"IF(Lønmodtager!$A69<>\"ÅÅÅ\",Lønmodtager!F69,\"\")","v":""},{"$f":"IF(Lønmodtager!$A69<>\"ÅÅÅ\",Lønmodtager!G69,\"\")","v":""},{"$f":"IF(Lønmodtager!$A69<>\"ÅÅÅ\",Lønmodtager!H69,\"\")","v":""},{"$f":"IF(Lønmodtager!$A69<>\"ÅÅÅ\",Lønmodtager!Q69,\"\")","v":""},{"$f":"IF(Lønmodtager!$A69<>\"ÅÅÅ\",Lønmodtager!R69,\"\")","v":""},{"$f":"IF(Lønmodtager!$A69<>\"ÅÅÅ\",Lønmodtager!AA69,\"\")","v":""},{"$f":"IF(Lønmodtager!$A69<>\"ÅÅÅ\",Lønmodtager!AB69,\"\")","v":""},{"$f":"IF(Lønmodtager!$A69<>\"ÅÅÅ\",Lønmodtager!AD69,\"\")","v":""},{"$f":"IF(Lønmodtager!$A69<>\"ÅÅÅ\",Lønmodtager!AC69,\"\")","v":""},{"$f":"IF(Lønmodtager!$A69<>\"ÅÅÅ\",Lønmodtager!AE69,\"\")","v":""},{"$f":"IF(Lønmodtager!$A69<>\"ÅÅÅ\",Lønmodtager!AF69,\"\")","v":""},{"$f":"IF(Lønmodtager!$A69<>\"ÅÅÅ\",Lønmodtager!AG69,\"\")","v":""},{"$f":"IF(Lønmodtager!$A69<>\"ÅÅÅ\",Lønmodtager!AK69,\"\")","v":""},{"$f":"IF(Lønmodtager!$A69<>\"ÅÅÅ\",Lønmodtager!AP69,\"\")","v":""},{"$f":"IF(Lønmodtager!$A69<>\"ÅÅÅ\",Lønmodtager!AL69,\"\")","v":""},{"$f":"IF(Lønmodtager!$A69<>\"ÅÅÅ\",Lønmodtager!AQ69,\"\")","v":""},{"$f":"IF(Lønmodtager!$A69<>\"ÅÅÅ\",Lønmodtager!AR69,\"\")","v":""}]
[{"$f":"IF(Lønmodtager!$A70<>\"ÅÅÅ\",Lønmodtager!A70,\"\")","v":""},{"$f":"IF(Lønmodtager!$A70<>\"ÅÅÅ\",Lønmodtager!F70,\"\")","v":""},{"$f":"IF(Lønmodtager!$A70<>\"ÅÅÅ\",Lønmodtager!G70,\"\")","v":""},{"$f":"IF(Lønmodtager!$A70<>\"ÅÅÅ\",Lønmodtager!H70,\"\")","v":""},{"$f":"IF(Lønmodtager!$A70<>\"ÅÅÅ\",Lønmodtager!Q70,\"\")","v":""},{"$f":"IF(Lønmodtager!$A70<>\"ÅÅÅ\",Lønmodtager!R70,\"\")","v":""},{"$f":"IF(Lønmodtager!$A70<>\"ÅÅÅ\",Lønmodtager!AA70,\"\")","v":""},{"$f":"IF(Lønmodtager!$A70<>\"ÅÅÅ\",Lønmodtager!AB70,\"\")","v":""},{"$f":"IF(Lønmodtager!$A70<>\"ÅÅÅ\",Lønmodtager!AD70,\"\")","v":""},{"$f":"IF(Lønmodtager!$A70<>\"ÅÅÅ\",Lønmodtager!AC70,\"\")","v":""},{"$f":"IF(Lønmodtager!$A70<>\"ÅÅÅ\",Lønmodtager!AE70,\"\")","v":""},{"$f":"IF(Lønmodtager!$A70<>\"ÅÅÅ\",Lønmodtager!AF70,\"\")","v":""},{"$f":"IF(Lønmodtager!$A70<>\"ÅÅÅ\",Lønmodtager!AG70,\"\")","v":""},{"$f":"IF(Lønmodtager!$A70<>\"ÅÅÅ\",Lønmodtager!AK70,\"\")","v":""},{"$f":"IF(Lønmodtager!$A70<>\"ÅÅÅ\",Lønmodtager!AP70,\"\")","v":""},{"$f":"IF(Lønmodtager!$A70<>\"ÅÅÅ\",Lønmodtager!AL70,\"\")","v":""},{"$f":"IF(Lønmodtager!$A70<>\"ÅÅÅ\",Lønmodtager!AQ70,\"\")","v":""},{"$f":"IF(Lønmodtager!$A70<>\"ÅÅÅ\",Lønmodtager!AR70,\"\")","v":""}]
[{"$f":"IF(Lønmodtager!$A71<>\"ÅÅÅ\",Lønmodtager!A71,\"\")","v":""},{"$f":"IF(Lønmodtager!$A71<>\"ÅÅÅ\",Lønmodtager!F71,\"\")","v":""},{"$f":"IF(Lønmodtager!$A71<>\"ÅÅÅ\",Lønmodtager!G71,\"\")","v":""},{"$f":"IF(Lønmodtager!$A71<>\"ÅÅÅ\",Lønmodtager!H71,\"\")","v":""},{"$f":"IF(Lønmodtager!$A71<>\"ÅÅÅ\",Lønmodtager!Q71,\"\")","v":""},{"$f":"IF(Lønmodtager!$A71<>\"ÅÅÅ\",Lønmodtager!R71,\"\")","v":""},{"$f":"IF(Lønmodtager!$A71<>\"ÅÅÅ\",Lønmodtager!AA71,\"\")","v":""},{"$f":"IF(Lønmodtager!$A71<>\"ÅÅÅ\",Lønmodtager!AB71,\"\")","v":""},{"$f":"IF(Lønmodtager!$A71<>\"ÅÅÅ\",Lønmodtager!AD71,\"\")","v":""},{"$f":"IF(Lønmodtager!$A71<>\"ÅÅÅ\",Lønmodtager!AC71,\"\")","v":""},{"$f":"IF(Lønmodtager!$A71<>\"ÅÅÅ\",Lønmodtager!AE71,\"\")","v":""},{"$f":"IF(Lønmodtager!$A71<>\"ÅÅÅ\",Lønmodtager!AF71,\"\")","v":""},{"$f":"IF(Lønmodtager!$A71<>\"ÅÅÅ\",Lønmodtager!AG71,\"\")","v":""},{"$f":"IF(Lønmodtager!$A71<>\"ÅÅÅ\",Lønmodtager!AK71,\"\")","v":""},{"$f":"IF(Lønmodtager!$A71<>\"ÅÅÅ\",Lønmodtager!AP71,\"\")","v":""},{"$f":"IF(Lønmodtager!$A71<>\"ÅÅÅ\",Lønmodtager!AL71,\"\")","v":""},{"$f":"IF(Lønmodtager!$A71<>\"ÅÅÅ\",Lønmodtager!AQ71,\"\")","v":""},{"$f":"IF(Lønmodtager!$A71<>\"ÅÅÅ\",Lønmodtager!AR71,\"\")","v":""}]
[{"$f":"IF(Lønmodtager!$A72<>\"ÅÅÅ\",Lønmodtager!A72,\"\")","v":""},{"$f":"IF(Lønmodtager!$A72<>\"ÅÅÅ\",Lønmodtager!F72,\"\")","v":""},{"$f":"IF(Lønmodtager!$A72<>\"ÅÅÅ\",Lønmodtager!G72,\"\")","v":""},{"$f":"IF(Lønmodtager!$A72<>\"ÅÅÅ\",Lønmodtager!H72,\"\")","v":""},{"$f":"IF(Lønmodtager!$A72<>\"ÅÅÅ\",Lønmodtager!Q72,\"\")","v":""},{"$f":"IF(Lønmodtager!$A72<>\"ÅÅÅ\",Lønmodtager!R72,\"\")","v":""},{"$f":"IF(Lønmodtager!$A72<>\"ÅÅÅ\",Lønmodtager!AA72,\"\")","v":""},{"$f":"IF(Lønmodtager!$A72<>\"ÅÅÅ\",Lønmodtager!AB72,\"\")","v":""},{"$f":"IF(Lønmodtager!$A72<>\"ÅÅÅ\",Lønmodtager!AD72,\"\")","v":""},{"$f":"IF(Lønmodtager!$A72<>\"ÅÅÅ\",Lønmodtager!AC72,\"\")","v":""},{"$f":"IF(Lønmodtager!$A72<>\"ÅÅÅ\",Lønmodtager!AE72,\"\")","v":""},{"$f":"IF(Lønmodtager!$A72<>\"ÅÅÅ\",Lønmodtager!AF72,\"\")","v":""},{"$f":"IF(Lønmodtager!$A72<>\"ÅÅÅ\",Lønmodtager!AG72,\"\")","v":""},{"$f":"IF(Lønmodtager!$A72<>\"ÅÅÅ\",Lønmodtager!AK72,\"\")","v":""},{"$f":"IF(Lønmodtager!$A72<>\"ÅÅÅ\",Lønmodtager!AP72,\"\")","v":""},{"$f":"IF(Lønmodtager!$A72<>\"ÅÅÅ\",Lønmodtager!AL72,\"\")","v":""},{"$f":"IF(Lønmodtager!$A72<>\"ÅÅÅ\",Lønmodtager!AQ72,\"\")","v":""},{"$f":"IF(Lønmodtager!$A72<>\"ÅÅÅ\",Lønmodtager!AR72,\"\")","v":""}]
[{"$f":"IF(Lønmodtager!$A73<>\"ÅÅÅ\",Lønmodtager!A73,\"\")","v":""},{"$f":"IF(Lønmodtager!$A73<>\"ÅÅÅ\",Lønmodtager!F73,\"\")","v":""},{"$f":"IF(Lønmodtager!$A73<>\"ÅÅÅ\",Lønmodtager!G73,\"\")","v":""},{"$f":"IF(Lønmodtager!$A73<>\"ÅÅÅ\",Lønmodtager!H73,\"\")","v":""},{"$f":"IF(Lønmodtager!$A73<>\"ÅÅÅ\",Lønmodtager!Q73,\"\")","v":""},{"$f":"IF(Lønmodtager!$A73<>\"ÅÅÅ\",Lønmodtager!R73,\"\")","v":""},{"$f":"IF(Lønmodtager!$A73<>\"ÅÅÅ\",Lønmodtager!AA73,\"\")","v":""},{"$f":"IF(Lønmodtager!$A73<>\"ÅÅÅ\",Lønmodtager!AB73,\"\")","v":""},{"$f":"IF(Lønmodtager!$A73<>\"ÅÅÅ\",Lønmodtager!AD73,\"\")","v":""},{"$f":"IF(Lønmodtager!$A73<>\"ÅÅÅ\",Lønmodtager!AC73,\"\")","v":""},{"$f":"IF(Lønmodtager!$A73<>\"ÅÅÅ\",Lønmodtager!AE73,\"\")","v":""},{"$f":"IF(Lønmodtager!$A73<>\"ÅÅÅ\",Lønmodtager!AF73,\"\")","v":""},{"$f":"IF(Lønmodtager!$A73<>\"ÅÅÅ\",Lønmodtager!AG73,\"\")","v":""},{"$f":"IF(Lønmodtager!$A73<>\"ÅÅÅ\",Lønmodtager!AK73,\"\")","v":""},{"$f":"IF(Lønmodtager!$A73<>\"ÅÅÅ\",Lønmodtager!AP73,\"\")","v":""},{"$f":"IF(Lønmodtager!$A73<>\"ÅÅÅ\",Lønmodtager!AL73,\"\")","v":""},{"$f":"IF(Lønmodtager!$A73<>\"ÅÅÅ\",Lønmodtager!AQ73,\"\")","v":""},{"$f":"IF(Lønmodtager!$A73<>\"ÅÅÅ\",Lønmodtager!AR73,\"\")","v":""}]
[{"$f":"IF(Lønmodtager!$A74<>\"ÅÅÅ\",Lønmodtager!A74,\"\")","v":""},{"$f":"IF(Lønmodtager!$A74<>\"ÅÅÅ\",Lønmodtager!F74,\"\")","v":""},{"$f":"IF(Lønmodtager!$A74<>\"ÅÅÅ\",Lønmodtager!G74,\"\")","v":""},{"$f":"IF(Lønmodtager!$A74<>\"ÅÅÅ\",Lønmodtager!H74,\"\")","v":""},{"$f":"IF(Lønmodtager!$A74<>\"ÅÅÅ\",Lønmodtager!Q74,\"\")","v":""},{"$f":"IF(Lønmodtager!$A74<>\"ÅÅÅ\",Lønmodtager!R74,\"\")","v":""},{"$f":"IF(Lønmodtager!$A74<>\"ÅÅÅ\",Lønmodtager!AA74,\"\")","v":""},{"$f":"IF(Lønmodtager!$A74<>\"ÅÅÅ\",Lønmodtager!AB74,\"\")","v":""},{"$f":"IF(Lønmodtager!$A74<>\"ÅÅÅ\",Lønmodtager!AD74,\"\")","v":""},{"$f":"IF(Lønmodtager!$A74<>\"ÅÅÅ\",Lønmodtager!AC74,\"\")","v":""},{"$f":"IF(Lønmodtager!$A74<>\"ÅÅÅ\",Lønmodtager!AE74,\"\")","v":""},{"$f":"IF(Lønmodtager!$A74<>\"ÅÅÅ\",Lønmodtager!AF74,\"\")","v":""},{"$f":"IF(Lønmodtager!$A74<>\"ÅÅÅ\",Lønmodtager!AG74,\"\")","v":""},{"$f":"IF(Lønmodtager!$A74<>\"ÅÅÅ\",Lønmodtager!AK74,\"\")","v":""},{"$f":"IF(Lønmodtager!$A74<>\"ÅÅÅ\",Lønmodtager!AP74,\"\")","v":""},{"$f":"IF(Lønmodtager!$A74<>\"ÅÅÅ\",Lønmodtager!AL74,\"\")","v":""},{"$f":"IF(Lønmodtager!$A74<>\"ÅÅÅ\",Lønmodtager!AQ74,\"\")","v":""},{"$f":"IF(Lønmodtager!$A74<>\"ÅÅÅ\",Lønmodtager!AR74,\"\")","v":""}]
[{"$f":"IF(Lønmodtager!$A75<>\"ÅÅÅ\",Lønmodtager!A75,\"\")","v":""},{"$f":"IF(Lønmodtager!$A75<>\"ÅÅÅ\",Lønmodtager!F75,\"\")","v":""},{"$f":"IF(Lønmodtager!$A75<>\"ÅÅÅ\",Lønmodtager!G75,\"\")","v":""},{"$f":"IF(Lønmodtager!$A75<>\"ÅÅÅ\",Lønmodtager!H75,\"\")","v":""},{"$f":"IF(Lønmodtager!$A75<>\"ÅÅÅ\",Lønmodtager!Q75,\"\")","v":""},{"$f":"IF(Lønmodtager!$A75<>\"ÅÅÅ\",Lønmodtager!R75,\"\")","v":""},{"$f":"IF(Lønmodtager!$A75<>\"ÅÅÅ\",Lønmodtager!AA75,\"\")","v":""},{"$f":"IF(Lønmodtager!$A75<>\"ÅÅÅ\",Lønmodtager!AB75,\"\")","v":""},{"$f":"IF(Lønmodtager!$A75<>\"ÅÅÅ\",Lønmodtager!AD75,\"\")","v":""},{"$f":"IF(Lønmodtager!$A75<>\"ÅÅÅ\",Lønmodtager!AC75,\"\")","v":""},{"$f":"IF(Lønmodtager!$A75<>\"ÅÅÅ\",Lønmodtager!AE75,\"\")","v":""},{"$f":"IF(Lønmodtager!$A75<>\"ÅÅÅ\",Lønmodtager!AF75,\"\")","v":""},{"$f":"IF(Lønmodtager!$A75<>\"ÅÅÅ\",Lønmodtager!AG75,\"\")","v":""},{"$f":"IF(Lønmodtager!$A75<>\"ÅÅÅ\",Lønmodtager!AK75,\"\")","v":""},{"$f":"IF(Lønmodtager!$A75<>\"ÅÅÅ\",Lønmodtager!AP75,\"\")","v":""},{"$f":"IF(Lønmodtager!$A75<>\"ÅÅÅ\",Lønmodtager!AL75,\"\")","v":""},{"$f":"IF(Lønmodtager!$A75<>\"ÅÅÅ\",Lønmodtager!AQ75,\"\")","v":""},{"$f":"IF(Lønmodtager!$A75<>\"ÅÅÅ\",Lønmodtager!AR75,\"\")","v":""}]
[{"$f":"IF(Lønmodtager!$A76<>\"ÅÅÅ\",Lønmodtager!A76,\"\")","v":""},{"$f":"IF(Lønmodtager!$A76<>\"ÅÅÅ\",Lønmodtager!F76,\"\")","v":""},{"$f":"IF(Lønmodtager!$A76<>\"ÅÅÅ\",Lønmodtager!G76,\"\")","v":""},{"$f":"IF(Lønmodtager!$A76<>\"ÅÅÅ\",Lønmodtager!H76,\"\")","v":""},{"$f":"IF(Lønmodtager!$A76<>\"ÅÅÅ\",Lønmodtager!Q76,\"\")","v":""},{"$f":"IF(Lønmodtager!$A76<>\"ÅÅÅ\",Lønmodtager!R76,\"\")","v":""},{"$f":"IF(Lønmodtager!$A76<>\"ÅÅÅ\",Lønmodtager!AA76,\"\")","v":""},{"$f":"IF(Lønmodtager!$A76<>\"ÅÅÅ\",Lønmodtager!AB76,\"\")","v":""},{"$f":"IF(Lønmodtager!$A76<>\"ÅÅÅ\",Lønmodtager!AD76,\"\")","v":""},{"$f":"IF(Lønmodtager!$A76<>\"ÅÅÅ\",Lønmodtager!AC76,\"\")","v":""},{"$f":"IF(Lønmodtager!$A76<>\"ÅÅÅ\",Lønmodtager!AE76,\"\")","v":""},{"$f":"IF(Lønmodtager!$A76<>\"ÅÅÅ\",Lønmodtager!AF76,\"\")","v":""},{"$f":"IF(Lønmodtager!$A76<>\"ÅÅÅ\",Lønmodtager!AG76,\"\")","v":""},{"$f":"IF(Lønmodtager!$A76<>\"ÅÅÅ\",Lønmodtager!AK76,\"\")","v":""},{"$f":"IF(Lønmodtager!$A76<>\"ÅÅÅ\",Lønmodtager!AP76,\"\")","v":""},{"$f":"IF(Lønmodtager!$A76<>\"ÅÅÅ\",Lønmodtager!AL76,\"\")","v":""},{"$f":"IF(Lønmodtager!$A76<>\"ÅÅÅ\",Lønmodtager!AQ76,\"\")","v":""},{"$f":"IF(Lønmodtager!$A76<>\"ÅÅÅ\",Lønmodtager!AR76,\"\")","v":""}]
[{"$f":"IF(Lønmodtager!$A77<>\"ÅÅÅ\",Lønmodtager!A77,\"\")","v":""},{"$f":"IF(Lønmodtager!$A77<>\"ÅÅÅ\",Lønmodtager!F77,\"\")","v":""},{"$f":"IF(Lønmodtager!$A77<>\"ÅÅÅ\",Lønmodtager!G77,\"\")","v":""},{"$f":"IF(Lønmodtager!$A77<>\"ÅÅÅ\",Lønmodtager!H77,\"\")","v":""},{"$f":"IF(Lønmodtager!$A77<>\"ÅÅÅ\",Lønmodtager!Q77,\"\")","v":""},{"$f":"IF(Lønmodtager!$A77<>\"ÅÅÅ\",Lønmodtager!R77,\"\")","v":""},{"$f":"IF(Lønmodtager!$A77<>\"ÅÅÅ\",Lønmodtager!AA77,\"\")","v":""},{"$f":"IF(Lønmodtager!$A77<>\"ÅÅÅ\",Lønmodtager!AB77,\"\")","v":""},{"$f":"IF(Lønmodtager!$A77<>\"ÅÅÅ\",Lønmodtager!AD77,\"\")","v":""},{"$f":"IF(Lønmodtager!$A77<>\"ÅÅÅ\",Lønmodtager!AC77,\"\")","v":""},{"$f":"IF(Lønmodtager!$A77<>\"ÅÅÅ\",Lønmodtager!AE77,\"\")","v":""},{"$f":"IF(Lønmodtager!$A77<>\"ÅÅÅ\",Lønmodtager!AF77,\"\")","v":""},{"$f":"IF(Lønmodtager!$A77<>\"ÅÅÅ\",Lønmodtager!AG77,\"\")","v":""},{"$f":"IF(Lønmodtager!$A77<>\"ÅÅÅ\",Lønmodtager!AK77,\"\")","v":""},{"$f":"IF(Lønmodtager!$A77<>\"ÅÅÅ\",Lønmodtager!AP77,\"\")","v":""},{"$f":"IF(Lønmodtager!$A77<>\"ÅÅÅ\",Lønmodtager!AL77,\"\")","v":""},{"$f":"IF(Lønmodtager!$A77<>\"ÅÅÅ\",Lønmodtager!AQ77,\"\")","v":""},{"$f":"IF(Lønmodtager!$A77<>\"ÅÅÅ\",Lønmodtager!AR77,\"\")","v":""}]
[{"$f":"IF(Lønmodtager!$A78<>\"ÅÅÅ\",Lønmodtager!A78,\"\")","v":""},{"$f":"IF(Lønmodtager!$A78<>\"ÅÅÅ\",Lønmodtager!F78,\"\")","v":""},{"$f":"IF(Lønmodtager!$A78<>\"ÅÅÅ\",Lønmodtager!G78,\"\")","v":""},{"$f":"IF(Lønmodtager!$A78<>\"ÅÅÅ\",Lønmodtager!H78,\"\")","v":""},{"$f":"IF(Lønmodtager!$A78<>\"ÅÅÅ\",Lønmodtager!Q78,\"\")","v":""},{"$f":"IF(Lønmodtager!$A78<>\"ÅÅÅ\",Lønmodtager!R78,\"\")","v":""},{"$f":"IF(Lønmodtager!$A78<>\"ÅÅÅ\",Lønmodtager!AA78,\"\")","v":""},{"$f":"IF(Lønmodtager!$A78<>\"ÅÅÅ\",Lønmodtager!AB78,\"\")","v":""},{"$f":"IF(Lønmodtager!$A78<>\"ÅÅÅ\",Lønmodtager!AD78,\"\")","v":""},{"$f":"IF(Lønmodtager!$A78<>\"ÅÅÅ\",Lønmodtager!AC78,\"\")","v":""},{"$f":"IF(Lønmodtager!$A78<>\"ÅÅÅ\",Lønmodtager!AE78,\"\")","v":""},{"$f":"IF(Lønmodtager!$A78<>\"ÅÅÅ\",Lønmodtager!AF78,\"\")","v":""},{"$f":"IF(Lønmodtager!$A78<>\"ÅÅÅ\",Lønmodtager!AG78,\"\")","v":""},{"$f":"IF(Lønmodtager!$A78<>\"ÅÅÅ\",Lønmodtager!AK78,\"\")","v":""},{"$f":"IF(Lønmodtager!$A78<>\"ÅÅÅ\",Lønmodtager!AP78,\"\")","v":""},{"$f":"IF(Lønmodtager!$A78<>\"ÅÅÅ\",Lønmodtager!AL78,\"\")","v":""},{"$f":"IF(Lønmodtager!$A78<>\"ÅÅÅ\",Lønmodtager!AQ78,\"\")","v":""},{"$f":"IF(Lønmodtager!$A78<>\"ÅÅÅ\",Lønmodtager!AR78,\"\")","v":""}]
[{"$f":"IF(Lønmodtager!$A79<>\"ÅÅÅ\",Lønmodtager!A79,\"\")","v":""},{"$f":"IF(Lønmodtager!$A79<>\"ÅÅÅ\",Lønmodtager!F79,\"\")","v":""},{"$f":"IF(Lønmodtager!$A79<>\"ÅÅÅ\",Lønmodtager!G79,\"\")","v":""},{"$f":"IF(Lønmodtager!$A79<>\"ÅÅÅ\",Lønmodtager!H79,\"\")","v":""},{"$f":"IF(Lønmodtager!$A79<>\"ÅÅÅ\",Lønmodtager!Q79,\"\")","v":""},{"$f":"IF(Lønmodtager!$A79<>\"ÅÅÅ\",Lønmodtager!R79,\"\")","v":""},{"$f":"IF(Lønmodtager!$A79<>\"ÅÅÅ\",Lønmodtager!AA79,\"\")","v":""},{"$f":"IF(Lønmodtager!$A79<>\"ÅÅÅ\",Lønmodtager!AB79,\"\")","v":""},{"$f":"IF(Lønmodtager!$A79<>\"ÅÅÅ\",Lønmodtager!AD79,\"\")","v":""},{"$f":"IF(Lønmodtager!$A79<>\"ÅÅÅ\",Lønmodtager!AC79,\"\")","v":""},{"$f":"IF(Lønmodtager!$A79<>\"ÅÅÅ\",Lønmodtager!AE79,\"\")","v":""},{"$f":"IF(Lønmodtager!$A79<>\"ÅÅÅ\",Lønmodtager!AF79,\"\")","v":""},{"$f":"IF(Lønmodtager!$A79<>\"ÅÅÅ\",Lønmodtager!AG79,\"\")","v":""},{"$f":"IF(Lønmodtager!$A79<>\"ÅÅÅ\",Lønmodtager!AK79,\"\")","v":""},{"$f":"IF(Lønmodtager!$A79<>\"ÅÅÅ\",Lønmodtager!AP79,\"\")","v":""},{"$f":"IF(Lønmodtager!$A79<>\"ÅÅÅ\",Lønmodtager!AL79,\"\")","v":""},{"$f":"IF(Lønmodtager!$A79<>\"ÅÅÅ\",Lønmodtager!AQ79,\"\")","v":""},{"$f":"IF(Lønmodtager!$A79<>\"ÅÅÅ\",Lønmodtager!AR79,\"\")","v":""}]
[{"$f":"IF(Lønmodtager!$A80<>\"ÅÅÅ\",Lønmodtager!A80,\"\")","v":""},{"$f":"IF(Lønmodtager!$A80<>\"ÅÅÅ\",Lønmodtager!F80,\"\")","v":""},{"$f":"IF(Lønmodtager!$A80<>\"ÅÅÅ\",Lønmodtager!G80,\"\")","v":""},{"$f":"IF(Lønmodtager!$A80<>\"ÅÅÅ\",Lønmodtager!H80,\"\")","v":""},{"$f":"IF(Lønmodtager!$A80<>\"ÅÅÅ\",Lønmodtager!Q80,\"\")","v":""},{"$f":"IF(Lønmodtager!$A80<>\"ÅÅÅ\",Lønmodtager!R80,\"\")","v":""},{"$f":"IF(Lønmodtager!$A80<>\"ÅÅÅ\",Lønmodtager!AA80,\"\")","v":""},{"$f":"IF(Lønmodtager!$A80<>\"ÅÅÅ\",Lønmodtager!AB80,\"\")","v":""},{"$f":"IF(Lønmodtager!$A80<>\"ÅÅÅ\",Lønmodtager!AD80,\"\")","v":""},{"$f":"IF(Lønmodtager!$A80<>\"ÅÅÅ\",Lønmodtager!AC80,\"\")","v":""},{"$f":"IF(Lønmodtager!$A80<>\"ÅÅÅ\",Lønmodtager!AE80,\"\")","v":""},{"$f":"IF(Lønmodtager!$A80<>\"ÅÅÅ\",Lønmodtager!AF80,\"\")","v":""},{"$f":"IF(Lønmodtager!$A80<>\"ÅÅÅ\",Lønmodtager!AG80,\"\")","v":""},{"$f":"IF(Lønmodtager!$A80<>\"ÅÅÅ\",Lønmodtager!AK80,\"\")","v":""},{"$f":"IF(Lønmodtager!$A80<>\"ÅÅÅ\",Lønmodtager!AP80,\"\")","v":""},{"$f":"IF(Lønmodtager!$A80<>\"ÅÅÅ\",Lønmodtager!AL80,\"\")","v":""},{"$f":"IF(Lønmodtager!$A80<>\"ÅÅÅ\",Lønmodtager!AQ80,\"\")","v":""},{"$f":"IF(Lønmodtager!$A80<>\"ÅÅÅ\",Lønmodtager!AR80,\"\")","v":""}]
[{"$f":"IF(Lønmodtager!$A81<>\"ÅÅÅ\",Lønmodtager!A81,\"\")","v":""},{"$f":"IF(Lønmodtager!$A81<>\"ÅÅÅ\",Lønmodtager!F81,\"\")","v":""},{"$f":"IF(Lønmodtager!$A81<>\"ÅÅÅ\",Lønmodtager!G81,\"\")","v":""},{"$f":"IF(Lønmodtager!$A81<>\"ÅÅÅ\",Lønmodtager!H81,\"\")","v":""},{"$f":"IF(Lønmodtager!$A81<>\"ÅÅÅ\",Lønmodtager!Q81,\"\")","v":""},{"$f":"IF(Lønmodtager!$A81<>\"ÅÅÅ\",Lønmodtager!R81,\"\")","v":""},{"$f":"IF(Lønmodtager!$A81<>\"ÅÅÅ\",Lønmodtager!AA81,\"\")","v":""},{"$f":"IF(Lønmodtager!$A81<>\"ÅÅÅ\",Lønmodtager!AB81,\"\")","v":""},{"$f":"IF(Lønmodtager!$A81<>\"ÅÅÅ\",Lønmodtager!AD81,\"\")","v":""},{"$f":"IF(Lønmodtager!$A81<>\"ÅÅÅ\",Lønmodtager!AC81,\"\")","v":""},{"$f":"IF(Lønmodtager!$A81<>\"ÅÅÅ\",Lønmodtager!AE81,\"\")","v":""},{"$f":"IF(Lønmodtager!$A81<>\"ÅÅÅ\",Lønmodtager!AF81,\"\")","v":""},{"$f":"IF(Lønmodtager!$A81<>\"ÅÅÅ\",Lønmodtager!AG81,\"\")","v":""},{"$f":"IF(Lønmodtager!$A81<>\"ÅÅÅ\",Lønmodtager!AK81,\"\")","v":""},{"$f":"IF(Lønmodtager!$A81<>\"ÅÅÅ\",Lønmodtager!AP81,\"\")","v":""},{"$f":"IF(Lønmodtager!$A81<>\"ÅÅÅ\",Lønmodtager!AL81,\"\")","v":""},{"$f":"IF(Lønmodtager!$A81<>\"ÅÅÅ\",Lønmodtager!AQ81,\"\")","v":""},{"$f":"IF(Lønmodtager!$A81<>\"ÅÅÅ\",Lønmodtager!AR81,\"\")","v":""}]
[{"$f":"IF(Lønmodtager!$A82<>\"ÅÅÅ\",Lønmodtager!A82,\"\")","v":""},{"$f":"IF(Lønmodtager!$A82<>\"ÅÅÅ\",Lønmodtager!F82,\"\")","v":""},{"$f":"IF(Lønmodtager!$A82<>\"ÅÅÅ\",Lønmodtager!G82,\"\")","v":""},{"$f":"IF(Lønmodtager!$A82<>\"ÅÅÅ\",Lønmodtager!H82,\"\")","v":""},{"$f":"IF(Lønmodtager!$A82<>\"ÅÅÅ\",Lønmodtager!Q82,\"\")","v":""},{"$f":"IF(Lønmodtager!$A82<>\"ÅÅÅ\",Lønmodtager!R82,\"\")","v":""},{"$f":"IF(Lønmodtager!$A82<>\"ÅÅÅ\",Lønmodtager!AA82,\"\")","v":""},{"$f":"IF(Lønmodtager!$A82<>\"ÅÅÅ\",Lønmodtager!AB82,\"\")","v":""},{"$f":"IF(Lønmodtager!$A82<>\"ÅÅÅ\",Lønmodtager!AD82,\"\")","v":""},{"$f":"IF(Lønmodtager!$A82<>\"ÅÅÅ\",Lønmodtager!AC82,\"\")","v":""},{"$f":"IF(Lønmodtager!$A82<>\"ÅÅÅ\",Lønmodtager!AE82,\"\")","v":""},{"$f":"IF(Lønmodtager!$A82<>\"ÅÅÅ\",Lønmodtager!AF82,\"\")","v":""},{"$f":"IF(Lønmodtager!$A82<>\"ÅÅÅ\",Lønmodtager!AG82,\"\")","v":""},{"$f":"IF(Lønmodtager!$A82<>\"ÅÅÅ\",Lønmodtager!AK82,\"\")","v":""},{"$f":"IF(Lønmodtager!$A82<>\"ÅÅÅ\",Lønmodtager!AP82,\"\")","v":""},{"$f":"IF(Lønmodtager!$A82<>\"ÅÅÅ\",Lønmodtager!AL82,\"\")","v":""},{"$f":"IF(Lønmodtager!$A82<>\"ÅÅÅ\",Lønmodtager!AQ82,\"\")","v":""},{"$f":"IF(Lønmodtager!$A82<>\"ÅÅÅ\",Lønmodtager!AR82,\"\")","v":""}]
[{"$f":"IF(Lønmodtager!$A83<>\"ÅÅÅ\",Lønmodtager!A83,\"\")","v":""},{"$f":"IF(Lønmodtager!$A83<>\"ÅÅÅ\",Lønmodtager!F83,\"\")","v":""},{"$f":"IF(Lønmodtager!$A83<>\"ÅÅÅ\",Lønmodtager!G83,\"\")","v":""},{"$f":"IF(Lønmodtager!$A83<>\"ÅÅÅ\",Lønmodtager!H83,\"\")","v":""},{"$f":"IF(Lønmodtager!$A83<>\"ÅÅÅ\",Lønmodtager!Q83,\"\")","v":""},{"$f":"IF(Lønmodtager!$A83<>\"ÅÅÅ\",Lønmodtager!R83,\"\")","v":""},{"$f":"IF(Lønmodtager!$A83<>\"ÅÅÅ\",Lønmodtager!AA83,\"\")","v":""},{"$f":"IF(Lønmodtager!$A83<>\"ÅÅÅ\",Lønmodtager!AB83,\"\")","v":""},{"$f":"IF(Lønmodtager!$A83<>\"ÅÅÅ\",Lønmodtager!AD83,\"\")","v":""},{"$f":"IF(Lønmodtager!$A83<>\"ÅÅÅ\",Lønmodtager!AC83,\"\")","v":""},{"$f":"IF(Lønmodtager!$A83<>\"ÅÅÅ\",Lønmodtager!AE83,\"\")","v":""},{"$f":"IF(Lønmodtager!$A83<>\"ÅÅÅ\",Lønmodtager!AF83,\"\")","v":""},{"$f":"IF(Lønmodtager!$A83<>\"ÅÅÅ\",Lønmodtager!AG83,\"\")","v":""},{"$f":"IF(Lønmodtager!$A83<>\"ÅÅÅ\",Lønmodtager!AK83,\"\")","v":""},{"$f":"IF(Lønmodtager!$A83<>\"ÅÅÅ\",Lønmodtager!AP83,\"\")","v":""},{"$f":"IF(Lønmodtager!$A83<>\"ÅÅÅ\",Lønmodtager!AL83,\"\")","v":""},{"$f":"IF(Lønmodtager!$A83<>\"ÅÅÅ\",Lønmodtager!AQ83,\"\")","v":""},{"$f":"IF(Lønmodtager!$A83<>\"ÅÅÅ\",Lønmodtager!AR83,\"\")","v":""}]
[{"$f":"IF(Lønmodtager!$A84<>\"ÅÅÅ\",Lønmodtager!A84,\"\")","v":""},{"$f":"IF(Lønmodtager!$A84<>\"ÅÅÅ\",Lønmodtager!F84,\"\")","v":""},{"$f":"IF(Lønmodtager!$A84<>\"ÅÅÅ\",Lønmodtager!G84,\"\")","v":""},{"$f":"IF(Lønmodtager!$A84<>\"ÅÅÅ\",Lønmodtager!H84,\"\")","v":""},{"$f":"IF(Lønmodtager!$A84<>\"ÅÅÅ\",Lønmodtager!Q84,\"\")","v":""},{"$f":"IF(Lønmodtager!$A84<>\"ÅÅÅ\",Lønmodtager!R84,\"\")","v":""},{"$f":"IF(Lønmodtager!$A84<>\"ÅÅÅ\",Lønmodtager!AA84,\"\")","v":""},{"$f":"IF(Lønmodtager!$A84<>\"ÅÅÅ\",Lønmodtager!AB84,\"\")","v":""},{"$f":"IF(Lønmodtager!$A84<>\"ÅÅÅ\",Lønmodtager!AD84,\"\")","v":""},{"$f":"IF(Lønmodtager!$A84<>\"ÅÅÅ\",Lønmodtager!AC84,\"\")","v":""},{"$f":"IF(Lønmodtager!$A84<>\"ÅÅÅ\",Lønmodtager!AE84,\"\")","v":""},{"$f":"IF(Lønmodtager!$A84<>\"ÅÅÅ\",Lønmodtager!AF84,\"\")","v":""},{"$f":"IF(Lønmodtager!$A84<>\"ÅÅÅ\",Lønmodtager!AG84,\"\")","v":""},{"$f":"IF(Lønmodtager!$A84<>\"ÅÅÅ\",Lønmodtager!AK84,\"\")","v":""},{"$f":"IF(Lønmodtager!$A84<>\"ÅÅÅ\",Lønmodtager!AP84,\"\")","v":""},{"$f":"IF(Lønmodtager!$A84<>\"ÅÅÅ\",Lønmodtager!AL84,\"\")","v":""},{"$f":"IF(Lønmodtager!$A84<>\"ÅÅÅ\",Lønmodtager!AQ84,\"\")","v":""},{"$f":"IF(Lønmodtager!$A84<>\"ÅÅÅ\",Lønmodtager!AR84,\"\")","v":""}]
[{"$f":"IF(Lønmodtager!$A85<>\"ÅÅÅ\",Lønmodtager!A85,\"\")","v":""},{"$f":"IF(Lønmodtager!$A85<>\"ÅÅÅ\",Lønmodtager!F85,\"\")","v":""},{"$f":"IF(Lønmodtager!$A85<>\"ÅÅÅ\",Lønmodtager!G85,\"\")","v":""},{"$f":"IF(Lønmodtager!$A85<>\"ÅÅÅ\",Lønmodtager!H85,\"\")","v":""},{"$f":"IF(Lønmodtager!$A85<>\"ÅÅÅ\",Lønmodtager!Q85,\"\")","v":""},{"$f":"IF(Lønmodtager!$A85<>\"ÅÅÅ\",Lønmodtager!R85,\"\")","v":""},{"$f":"IF(Lønmodtager!$A85<>\"ÅÅÅ\",Lønmodtager!AA85,\"\")","v":""},{"$f":"IF(Lønmodtager!$A85<>\"ÅÅÅ\",Lønmodtager!AB85,\"\")","v":""},{"$f":"IF(Lønmodtager!$A85<>\"ÅÅÅ\",Lønmodtager!AD85,\"\")","v":""},{"$f":"IF(Lønmodtager!$A85<>\"ÅÅÅ\",Lønmodtager!AC85,\"\")","v":""},{"$f":"IF(Lønmodtager!$A85<>\"ÅÅÅ\",Lønmodtager!AE85,\"\")","v":""},{"$f":"IF(Lønmodtager!$A85<>\"ÅÅÅ\",Lønmodtager!AF85,\"\")","v":""},{"$f":"IF(Lønmodtager!$A85<>\"ÅÅÅ\",Lønmodtager!AG85,\"\")","v":""},{"$f":"IF(Lønmodtager!$A85<>\"ÅÅÅ\",Lønmodtager!AK85,\"\")","v":""},{"$f":"IF(Lønmodtager!$A85<>\"ÅÅÅ\",Lønmodtager!AP85,\"\")","v":""},{"$f":"IF(Lønmodtager!$A85<>\"ÅÅÅ\",Lønmodtager!AL85,\"\")","v":""},{"$f":"IF(Lønmodtager!$A85<>\"ÅÅÅ\",Lønmodtager!AQ85,\"\")","v":""},{"$f":"IF(Lønmodtager!$A85<>\"ÅÅÅ\",Lønmodtager!AR85,\"\")","v":""}]
[{"$f":"IF(Lønmodtager!$A86<>\"ÅÅÅ\",Lønmodtager!A86,\"\")","v":""},{"$f":"IF(Lønmodtager!$A86<>\"ÅÅÅ\",Lønmodtager!F86,\"\")","v":""},{"$f":"IF(Lønmodtager!$A86<>\"ÅÅÅ\",Lønmodtager!G86,\"\")","v":""},{"$f":"IF(Lønmodtager!$A86<>\"ÅÅÅ\",Lønmodtager!H86,\"\")","v":""},{"$f":"IF(Lønmodtager!$A86<>\"ÅÅÅ\",Lønmodtager!Q86,\"\")","v":""},{"$f":"IF(Lønmodtager!$A86<>\"ÅÅÅ\",Lønmodtager!R86,\"\")","v":""},{"$f":"IF(Lønmodtager!$A86<>\"ÅÅÅ\",Lønmodtager!AA86,\"\")","v":""},{"$f":"IF(Lønmodtager!$A86<>\"ÅÅÅ\",Lønmodtager!AB86,\"\")","v":""},{"$f":"IF(Lønmodtager!$A86<>\"ÅÅÅ\",Lønmodtager!AD86,\"\")","v":""},{"$f":"IF(Lønmodtager!$A86<>\"ÅÅÅ\",Lønmodtager!AC86,\"\")","v":""},{"$f":"IF(Lønmodtager!$A86<>\"ÅÅÅ\",Lønmodtager!AE86,\"\")","v":""},{"$f":"IF(Lønmodtager!$A86<>\"ÅÅÅ\",Lønmodtager!AF86,\"\")","v":""},{"$f":"IF(Lønmodtager!$A86<>\"ÅÅÅ\",Lønmodtager!AG86,\"\")","v":""},{"$f":"IF(Lønmodtager!$A86<>\"ÅÅÅ\",Lønmodtager!AK86,\"\")","v":""},{"$f":"IF(Lønmodtager!$A86<>\"ÅÅÅ\",Lønmodtager!AP86,\"\")","v":""},{"$f":"IF(Lønmodtager!$A86<>\"ÅÅÅ\",Lønmodtager!AL86,\"\")","v":""},{"$f":"IF(Lønmodtager!$A86<>\"ÅÅÅ\",Lønmodtager!AQ86,\"\")","v":""},{"$f":"IF(Lønmodtager!$A86<>\"ÅÅÅ\",Lønmodtager!AR86,\"\")","v":""}]
[{"$f":"IF(Lønmodtager!$A87<>\"ÅÅÅ\",Lønmodtager!A87,\"\")","v":""},{"$f":"IF(Lønmodtager!$A87<>\"ÅÅÅ\",Lønmodtager!F87,\"\")","v":""},{"$f":"IF(Lønmodtager!$A87<>\"ÅÅÅ\",Lønmodtager!G87,\"\")","v":""},{"$f":"IF(Lønmodtager!$A87<>\"ÅÅÅ\",Lønmodtager!H87,\"\")","v":""},{"$f":"IF(Lønmodtager!$A87<>\"ÅÅÅ\",Lønmodtager!Q87,\"\")","v":""},{"$f":"IF(Lønmodtager!$A87<>\"ÅÅÅ\",Lønmodtager!R87,\"\")","v":""},{"$f":"IF(Lønmodtager!$A87<>\"ÅÅÅ\",Lønmodtager!AA87,\"\")","v":""},{"$f":"IF(Lønmodtager!$A87<>\"ÅÅÅ\",Lønmodtager!AB87,\"\")","v":""},{"$f":"IF(Lønmodtager!$A87<>\"ÅÅÅ\",Lønmodtager!AD87,\"\")","v":""},{"$f":"IF(Lønmodtager!$A87<>\"ÅÅÅ\",Lønmodtager!AC87,\"\")","v":""},{"$f":"IF(Lønmodtager!$A87<>\"ÅÅÅ\",Lønmodtager!AE87,\"\")","v":""},{"$f":"IF(Lønmodtager!$A87<>\"ÅÅÅ\",Lønmodtager!AF87,\"\")","v":""},{"$f":"IF(Lønmodtager!$A87<>\"ÅÅÅ\",Lønmodtager!AG87,\"\")","v":""},{"$f":"IF(Lønmodtager!$A87<>\"ÅÅÅ\",Lønmodtager!AK87,\"\")","v":""},{"$f":"IF(Lønmodtager!$A87<>\"ÅÅÅ\",Lønmodtager!AP87,\"\")","v":""},{"$f":"IF(Lønmodtager!$A87<>\"ÅÅÅ\",Lønmodtager!AL87,\"\")","v":""},{"$f":"IF(Lønmodtager!$A87<>\"ÅÅÅ\",Lønmodtager!AQ87,\"\")","v":""},{"$f":"IF(Lønmodtager!$A87<>\"ÅÅÅ\",Lønmodtager!AR87,\"\")","v":""}]
[{"$f":"IF(Lønmodtager!$A88<>\"ÅÅÅ\",Lønmodtager!A88,\"\")","v":""},{"$f":"IF(Lønmodtager!$A88<>\"ÅÅÅ\",Lønmodtager!F88,\"\")","v":""},{"$f":"IF(Lønmodtager!$A88<>\"ÅÅÅ\",Lønmodtager!G88,\"\")","v":""},{"$f":"IF(Lønmodtager!$A88<>\"ÅÅÅ\",Lønmodtager!H88,\"\")","v":""},{"$f":"IF(Lønmodtager!$A88<>\"ÅÅÅ\",Lønmodtager!Q88,\"\")","v":""},{"$f":"IF(Lønmodtager!$A88<>\"ÅÅÅ\",Lønmodtager!R88,\"\")","v":""},{"$f":"IF(Lønmodtager!$A88<>\"ÅÅÅ\",Lønmodtager!AA88,\"\")","v":""},{"$f":"IF(Lønmodtager!$A88<>\"ÅÅÅ\",Lønmodtager!AB88,\"\")","v":""},{"$f":"IF(Lønmodtager!$A88<>\"ÅÅÅ\",Lønmodtager!AD88,\"\")","v":""},{"$f":"IF(Lønmodtager!$A88<>\"ÅÅÅ\",Lønmodtager!AC88,\"\")","v":""},{"$f":"IF(Lønmodtager!$A88<>\"ÅÅÅ\",Lønmodtager!AE88,\"\")","v":""},{"$f":"IF(Lønmodtager!$A88<>\"ÅÅÅ\",Lønmodtager!AF88,\"\")","v":""},{"$f":"IF(Lønmodtager!$A88<>\"ÅÅÅ\",Lønmodtager!AG88,\"\")","v":""},{"$f":"IF(Lønmodtager!$A88<>\"ÅÅÅ\",Lønmodtager!AK88,\"\")","v":""},{"$f":"IF(Lønmodtager!$A88<>\"ÅÅÅ\",Lønmodtager!AP88,\"\")","v":""},{"$f":"IF(Lønmodtager!$A88<>\"ÅÅÅ\",Lønmodtager!AL88,\"\")","v":""},{"$f":"IF(Lønmodtager!$A88<>\"ÅÅÅ\",Lønmodtager!AQ88,\"\")","v":""},{"$f":"IF(Lønmodtager!$A88<>\"ÅÅÅ\",Lønmodtager!AR88,\"\")","v":""}]
[{"$f":"IF(Lønmodtager!$A89<>\"ÅÅÅ\",Lønmodtager!A89,\"\")","v":""},{"$f":"IF(Lønmodtager!$A89<>\"ÅÅÅ\",Lønmodtager!F89,\"\")","v":""},{"$f":"IF(Lønmodtager!$A89<>\"ÅÅÅ\",Lønmodtager!G89,\"\")","v":""},{"$f":"IF(Lønmodtager!$A89<>\"ÅÅÅ\",Lønmodtager!H89,\"\")","v":""},{"$f":"IF(Lønmodtager!$A89<>\"ÅÅÅ\",Lønmodtager!Q89,\"\")","v":""},{"$f":"IF(Lønmodtager!$A89<>\"ÅÅÅ\",Lønmodtager!R89,\"\")","v":""},{"$f":"IF(Lønmodtager!$A89<>\"ÅÅÅ\",Lønmodtager!AA89,\"\")","v":""},{"$f":"IF(Lønmodtager!$A89<>\"ÅÅÅ\",Lønmodtager!AB89,\"\")","v":""},{"$f":"IF(Lønmodtager!$A89<>\"ÅÅÅ\",Lønmodtager!AD89,\"\")","v":""},{"$f":"IF(Lønmodtager!$A89<>\"ÅÅÅ\",Lønmodtager!AC89,\"\")","v":""},{"$f":"IF(Lønmodtager!$A89<>\"ÅÅÅ\",Lønmodtager!AE89,\"\")","v":""},{"$f":"IF(Lønmodtager!$A89<>\"ÅÅÅ\",Lønmodtager!AF89,\"\")","v":""},{"$f":"IF(Lønmodtager!$A89<>\"ÅÅÅ\",Lønmodtager!AG89,\"\")","v":""},{"$f":"IF(Lønmodtager!$A89<>\"ÅÅÅ\",Lønmodtager!AK89,\"\")","v":""},{"$f":"IF(Lønmodtager!$A89<>\"ÅÅÅ\",Lønmodtager!AP89,\"\")","v":""},{"$f":"IF(Lønmodtager!$A89<>\"ÅÅÅ\",Lønmodtager!AL89,\"\")","v":""},{"$f":"IF(Lønmodtager!$A89<>\"ÅÅÅ\",Lønmodtager!AQ89,\"\")","v":""},{"$f":"IF(Lønmodtager!$A89<>\"ÅÅÅ\",Lønmodtager!AR89,\"\")","v":""}]
[{"$f":"IF(Lønmodtager!$A90<>\"ÅÅÅ\",Lønmodtager!A90,\"\")","v":""},{"$f":"IF(Lønmodtager!$A90<>\"ÅÅÅ\",Lønmodtager!F90,\"\")","v":""},{"$f":"IF(Lønmodtager!$A90<>\"ÅÅÅ\",Lønmodtager!G90,\"\")","v":""},{"$f":"IF(Lønmodtager!$A90<>\"ÅÅÅ\",Lønmodtager!H90,\"\")","v":""},{"$f":"IF(Lønmodtager!$A90<>\"ÅÅÅ\",Lønmodtager!Q90,\"\")","v":""},{"$f":"IF(Lønmodtager!$A90<>\"ÅÅÅ\",Lønmodtager!R90,\"\")","v":""},{"$f":"IF(Lønmodtager!$A90<>\"ÅÅÅ\",Lønmodtager!AA90,\"\")","v":""},{"$f":"IF(Lønmodtager!$A90<>\"ÅÅÅ\",Lønmodtager!AB90,\"\")","v":""},{"$f":"IF(Lønmodtager!$A90<>\"ÅÅÅ\",Lønmodtager!AD90,\"\")","v":""},{"$f":"IF(Lønmodtager!$A90<>\"ÅÅÅ\",Lønmodtager!AC90,\"\")","v":""},{"$f":"IF(Lønmodtager!$A90<>\"ÅÅÅ\",Lønmodtager!AE90,\"\")","v":""},{"$f":"IF(Lønmodtager!$A90<>\"ÅÅÅ\",Lønmodtager!AF90,\"\")","v":""},{"$f":"IF(Lønmodtager!$A90<>\"ÅÅÅ\",Lønmodtager!AG90,\"\")","v":""},{"$f":"IF(Lønmodtager!$A90<>\"ÅÅÅ\",Lønmodtager!AK90,\"\")","v":""},{"$f":"IF(Lønmodtager!$A90<>\"ÅÅÅ\",Lønmodtager!AP90,\"\")","v":""},{"$f":"IF(Lønmodtager!$A90<>\"ÅÅÅ\",Lønmodtager!AL90,\"\")","v":""},{"$f":"IF(Lønmodtager!$A90<>\"ÅÅÅ\",Lønmodtager!AQ90,\"\")","v":""},{"$f":"IF(Lønmodtager!$A90<>\"ÅÅÅ\",Lønmodtager!AR90,\"\")","v":""}]
[{"$f":"IF(Lønmodtager!$A91<>\"ÅÅÅ\",Lønmodtager!A91,\"\")","v":""},{"$f":"IF(Lønmodtager!$A91<>\"ÅÅÅ\",Lønmodtager!F91,\"\")","v":""},{"$f":"IF(Lønmodtager!$A91<>\"ÅÅÅ\",Lønmodtager!G91,\"\")","v":""},{"$f":"IF(Lønmodtager!$A91<>\"ÅÅÅ\",Lønmodtager!H91,\"\")","v":""},{"$f":"IF(Lønmodtager!$A91<>\"ÅÅÅ\",Lønmodtager!Q91,\"\")","v":""},{"$f":"IF(Lønmodtager!$A91<>\"ÅÅÅ\",Lønmodtager!R91,\"\")","v":""},{"$f":"IF(Lønmodtager!$A91<>\"ÅÅÅ\",Lønmodtager!AA91,\"\")","v":""},{"$f":"IF(Lønmodtager!$A91<>\"ÅÅÅ\",Lønmodtager!AB91,\"\")","v":""},{"$f":"IF(Lønmodtager!$A91<>\"ÅÅÅ\",Lønmodtager!AD91,\"\")","v":""},{"$f":"IF(Lønmodtager!$A91<>\"ÅÅÅ\",Lønmodtager!AC91,\"\")","v":""},{"$f":"IF(Lønmodtager!$A91<>\"ÅÅÅ\",Lønmodtager!AE91,\"\")","v":""},{"$f":"IF(Lønmodtager!$A91<>\"ÅÅÅ\",Lønmodtager!AF91,\"\")","v":""},{"$f":"IF(Lønmodtager!$A91<>\"ÅÅÅ\",Lønmodtager!AG91,\"\")","v":""},{"$f":"IF(Lønmodtager!$A91<>\"ÅÅÅ\",Lønmodtager!AK91,\"\")","v":""},{"$f":"IF(Lønmodtager!$A91<>\"ÅÅÅ\",Lønmodtager!AP91,\"\")","v":""},{"$f":"IF(Lønmodtager!$A91<>\"ÅÅÅ\",Lønmodtager!AL91,\"\")","v":""},{"$f":"IF(Lønmodtager!$A91<>\"ÅÅÅ\",Lønmodtager!AQ91,\"\")","v":""},{"$f":"IF(Lønmodtager!$A91<>\"ÅÅÅ\",Lønmodtager!AR91,\"\")","v":""}]
[{"$f":"IF(Lønmodtager!$A92<>\"ÅÅÅ\",Lønmodtager!A92,\"\")","v":""},{"$f":"IF(Lønmodtager!$A92<>\"ÅÅÅ\",Lønmodtager!F92,\"\")","v":""},{"$f":"IF(Lønmodtager!$A92<>\"ÅÅÅ\",Lønmodtager!G92,\"\")","v":""},{"$f":"IF(Lønmodtager!$A92<>\"ÅÅÅ\",Lønmodtager!H92,\"\")","v":""},{"$f":"IF(Lønmodtager!$A92<>\"ÅÅÅ\",Lønmodtager!Q92,\"\")","v":""},{"$f":"IF(Lønmodtager!$A92<>\"ÅÅÅ\",Lønmodtager!R92,\"\")","v":""},{"$f":"IF(Lønmodtager!$A92<>\"ÅÅÅ\",Lønmodtager!AA92,\"\")","v":""},{"$f":"IF(Lønmodtager!$A92<>\"ÅÅÅ\",Lønmodtager!AB92,\"\")","v":""},{"$f":"IF(Lønmodtager!$A92<>\"ÅÅÅ\",Lønmodtager!AD92,\"\")","v":""},{"$f":"IF(Lønmodtager!$A92<>\"ÅÅÅ\",Lønmodtager!AC92,\"\")","v":""},{"$f":"IF(Lønmodtager!$A92<>\"ÅÅÅ\",Lønmodtager!AE92,\"\")","v":""},{"$f":"IF(Lønmodtager!$A92<>\"ÅÅÅ\",Lønmodtager!AF92,\"\")","v":""},{"$f":"IF(Lønmodtager!$A92<>\"ÅÅÅ\",Lønmodtager!AG92,\"\")","v":""},{"$f":"IF(Lønmodtager!$A92<>\"ÅÅÅ\",Lønmodtager!AK92,\"\")","v":""},{"$f":"IF(Lønmodtager!$A92<>\"ÅÅÅ\",Lønmodtager!AP92,\"\")","v":""},{"$f":"IF(Lønmodtager!$A92<>\"ÅÅÅ\",Lønmodtager!AL92,\"\")","v":""},{"$f":"IF(Lønmodtager!$A92<>\"ÅÅÅ\",Lønmodtager!AQ92,\"\")","v":""},{"$f":"IF(Lønmodtager!$A92<>\"ÅÅÅ\",Lønmodtager!AR92,\"\")","v":""}]
[{"$f":"IF(Lønmodtager!$A93<>\"ÅÅÅ\",Lønmodtager!A93,\"\")","v":""},{"$f":"IF(Lønmodtager!$A93<>\"ÅÅÅ\",Lønmodtager!F93,\"\")","v":""},{"$f":"IF(Lønmodtager!$A93<>\"ÅÅÅ\",Lønmodtager!G93,\"\")","v":""},{"$f":"IF(Lønmodtager!$A93<>\"ÅÅÅ\",Lønmodtager!H93,\"\")","v":""},{"$f":"IF(Lønmodtager!$A93<>\"ÅÅÅ\",Lønmodtager!Q93,\"\")","v":""},{"$f":"IF(Lønmodtager!$A93<>\"ÅÅÅ\",Lønmodtager!R93,\"\")","v":""},{"$f":"IF(Lønmodtager!$A93<>\"ÅÅÅ\",Lønmodtager!AA93,\"\")","v":""},{"$f":"IF(Lønmodtager!$A93<>\"ÅÅÅ\",Lønmodtager!AB93,\"\")","v":""},{"$f":"IF(Lønmodtager!$A93<>\"ÅÅÅ\",Lønmodtager!AD93,\"\")","v":""},{"$f":"IF(Lønmodtager!$A93<>\"ÅÅÅ\",Lønmodtager!AC93,\"\")","v":""},{"$f":"IF(Lønmodtager!$A93<>\"ÅÅÅ\",Lønmodtager!AE93,\"\")","v":""},{"$f":"IF(Lønmodtager!$A93<>\"ÅÅÅ\",Lønmodtager!AF93,\"\")","v":""},{"$f":"IF(Lønmodtager!$A93<>\"ÅÅÅ\",Lønmodtager!AG93,\"\")","v":""},{"$f":"IF(Lønmodtager!$A93<>\"ÅÅÅ\",Lønmodtager!AK93,\"\")","v":""},{"$f":"IF(Lønmodtager!$A93<>\"ÅÅÅ\",Lønmodtager!AP93,\"\")","v":""},{"$f":"IF(Lønmodtager!$A93<>\"ÅÅÅ\",Lønmodtager!AL93,\"\")","v":""},{"$f":"IF(Lønmodtager!$A93<>\"ÅÅÅ\",Lønmodtager!AQ93,\"\")","v":""},{"$f":"IF(Lønmodtager!$A93<>\"ÅÅÅ\",Lønmodtager!AR93,\"\")","v":""}]
[{"$f":"IF(Lønmodtager!$A94<>\"ÅÅÅ\",Lønmodtager!A94,\"\")","v":""},{"$f":"IF(Lønmodtager!$A94<>\"ÅÅÅ\",Lønmodtager!F94,\"\")","v":""},{"$f":"IF(Lønmodtager!$A94<>\"ÅÅÅ\",Lønmodtager!G94,\"\")","v":""},{"$f":"IF(Lønmodtager!$A94<>\"ÅÅÅ\",Lønmodtager!H94,\"\")","v":""},{"$f":"IF(Lønmodtager!$A94<>\"ÅÅÅ\",Lønmodtager!Q94,\"\")","v":""},{"$f":"IF(Lønmodtager!$A94<>\"ÅÅÅ\",Lønmodtager!R94,\"\")","v":""},{"$f":"IF(Lønmodtager!$A94<>\"ÅÅÅ\",Lønmodtager!AA94,\"\")","v":""},{"$f":"IF(Lønmodtager!$A94<>\"ÅÅÅ\",Lønmodtager!AB94,\"\")","v":""},{"$f":"IF(Lønmodtager!$A94<>\"ÅÅÅ\",Lønmodtager!AD94,\"\")","v":""},{"$f":"IF(Lønmodtager!$A94<>\"ÅÅÅ\",Lønmodtager!AC94,\"\")","v":""},{"$f":"IF(Lønmodtager!$A94<>\"ÅÅÅ\",Lønmodtager!AE94,\"\")","v":""},{"$f":"IF(Lønmodtager!$A94<>\"ÅÅÅ\",Lønmodtager!AF94,\"\")","v":""},{"$f":"IF(Lønmodtager!$A94<>\"ÅÅÅ\",Lønmodtager!AG94,\"\")","v":""},{"$f":"IF(Lønmodtager!$A94<>\"ÅÅÅ\",Lønmodtager!AK94,\"\")","v":""},{"$f":"IF(Lønmodtager!$A94<>\"ÅÅÅ\",Lønmodtager!AP94,\"\")","v":""},{"$f":"IF(Lønmodtager!$A94<>\"ÅÅÅ\",Lønmodtager!AL94,\"\")","v":""},{"$f":"IF(Lønmodtager!$A94<>\"ÅÅÅ\",Lønmodtager!AQ94,\"\")","v":""},{"$f":"IF(Lønmodtager!$A94<>\"ÅÅÅ\",Lønmodtager!AR94,\"\")","v":""}]
[{"$f":"IF(Lønmodtager!$A95<>\"ÅÅÅ\",Lønmodtager!A95,\"\")","v":""},{"$f":"IF(Lønmodtager!$A95<>\"ÅÅÅ\",Lønmodtager!F95,\"\")","v":""},{"$f":"IF(Lønmodtager!$A95<>\"ÅÅÅ\",Lønmodtager!G95,\"\")","v":""},{"$f":"IF(Lønmodtager!$A95<>\"ÅÅÅ\",Lønmodtager!H95,\"\")","v":""},{"$f":"IF(Lønmodtager!$A95<>\"ÅÅÅ\",Lønmodtager!Q95,\"\")","v":""},{"$f":"IF(Lønmodtager!$A95<>\"ÅÅÅ\",Lønmodtager!R95,\"\")","v":""},{"$f":"IF(Lønmodtager!$A95<>\"ÅÅÅ\",Lønmodtager!AA95,\"\")","v":""},{"$f":"IF(Lønmodtager!$A95<>\"ÅÅÅ\",Lønmodtager!AB95,\"\")","v":""},{"$f":"IF(Lønmodtager!$A95<>\"ÅÅÅ\",Lønmodtager!AD95,\"\")","v":""},{"$f":"IF(Lønmodtager!$A95<>\"ÅÅÅ\",Lønmodtager!AC95,\"\")","v":""},{"$f":"IF(Lønmodtager!$A95<>\"ÅÅÅ\",Lønmodtager!AE95,\"\")","v":""},{"$f":"IF(Lønmodtager!$A95<>\"ÅÅÅ\",Lønmodtager!AF95,\"\")","v":""},{"$f":"IF(Lønmodtager!$A95<>\"ÅÅÅ\",Lønmodtager!AG95,\"\")","v":""},{"$f":"IF(Lønmodtager!$A95<>\"ÅÅÅ\",Lønmodtager!AK95,\"\")","v":""},{"$f":"IF(Lønmodtager!$A95<>\"ÅÅÅ\",Lønmodtager!AP95,\"\")","v":""},{"$f":"IF(Lønmodtager!$A95<>\"ÅÅÅ\",Lønmodtager!AL95,\"\")","v":""},{"$f":"IF(Lønmodtager!$A95<>\"ÅÅÅ\",Lønmodtager!AQ95,\"\")","v":""},{"$f":"IF(Lønmodtager!$A95<>\"ÅÅÅ\",Lønmodtager!AR95,\"\")","v":""}]
[{"$f":"IF(Lønmodtager!$A96<>\"ÅÅÅ\",Lønmodtager!A96,\"\")","v":""},{"$f":"IF(Lønmodtager!$A96<>\"ÅÅÅ\",Lønmodtager!F96,\"\")","v":""},{"$f":"IF(Lønmodtager!$A96<>\"ÅÅÅ\",Lønmodtager!G96,\"\")","v":""},{"$f":"IF(Lønmodtager!$A96<>\"ÅÅÅ\",Lønmodtager!H96,\"\")","v":""},{"$f":"IF(Lønmodtager!$A96<>\"ÅÅÅ\",Lønmodtager!Q96,\"\")","v":""},{"$f":"IF(Lønmodtager!$A96<>\"ÅÅÅ\",Lønmodtager!R96,\"\")","v":""},{"$f":"IF(Lønmodtager!$A96<>\"ÅÅÅ\",Lønmodtager!AA96,\"\")","v":""},{"$f":"IF(Lønmodtager!$A96<>\"ÅÅÅ\",Lønmodtager!AB96,\"\")","v":""},{"$f":"IF(Lønmodtager!$A96<>\"ÅÅÅ\",Lønmodtager!AD96,\"\")","v":""},{"$f":"IF(Lønmodtager!$A96<>\"ÅÅÅ\",Lønmodtager!AC96,\"\")","v":""},{"$f":"IF(Lønmodtager!$A96<>\"ÅÅÅ\",Lønmodtager!AE96,\"\")","v":""},{"$f":"IF(Lønmodtager!$A96<>\"ÅÅÅ\",Lønmodtager!AF96,\"\")","v":""},{"$f":"IF(Lønmodtager!$A96<>\"ÅÅÅ\",Lønmodtager!AG96,\"\")","v":""},{"$f":"IF(Lønmodtager!$A96<>\"ÅÅÅ\",Lønmodtager!AK96,\"\")","v":""},{"$f":"IF(Lønmodtager!$A96<>\"ÅÅÅ\",Lønmodtager!AP96,\"\")","v":""},{"$f":"IF(Lønmodtager!$A96<>\"ÅÅÅ\",Lønmodtager!AL96,\"\")","v":""},{"$f":"IF(Lønmodtager!$A96<>\"ÅÅÅ\",Lønmodtager!AQ96,\"\")","v":""},{"$f":"IF(Lønmodtager!$A96<>\"ÅÅÅ\",Lønmodtager!AR96,\"\")","v":""}]
[{"$f":"IF(Lønmodtager!$A97<>\"ÅÅÅ\",Lønmodtager!A97,\"\")","v":""},{"$f":"IF(Lønmodtager!$A97<>\"ÅÅÅ\",Lønmodtager!F97,\"\")","v":""},{"$f":"IF(Lønmodtager!$A97<>\"ÅÅÅ\",Lønmodtager!G97,\"\")","v":""},{"$f":"IF(Lønmodtager!$A97<>\"ÅÅÅ\",Lønmodtager!H97,\"\")","v":""},{"$f":"IF(Lønmodtager!$A97<>\"ÅÅÅ\",Lønmodtager!Q97,\"\")","v":""},{"$f":"IF(Lønmodtager!$A97<>\"ÅÅÅ\",Lønmodtager!R97,\"\")","v":""},{"$f":"IF(Lønmodtager!$A97<>\"ÅÅÅ\",Lønmodtager!AA97,\"\")","v":""},{"$f":"IF(Lønmodtager!$A97<>\"ÅÅÅ\",Lønmodtager!AB97,\"\")","v":""},{"$f":"IF(Lønmodtager!$A97<>\"ÅÅÅ\",Lønmodtager!AD97,\"\")","v":""},{"$f":"IF(Lønmodtager!$A97<>\"ÅÅÅ\",Lønmodtager!AC97,\"\")","v":""},{"$f":"IF(Lønmodtager!$A97<>\"ÅÅÅ\",Lønmodtager!AE97,\"\")","v":""},{"$f":"IF(Lønmodtager!$A97<>\"ÅÅÅ\",Lønmodtager!AF97,\"\")","v":""},{"$f":"IF(Lønmodtager!$A97<>\"ÅÅÅ\",Lønmodtager!AG97,\"\")","v":""},{"$f":"IF(Lønmodtager!$A97<>\"ÅÅÅ\",Lønmodtager!AK97,\"\")","v":""},{"$f":"IF(Lønmodtager!$A97<>\"ÅÅÅ\",Lønmodtager!AP97,\"\")","v":""},{"$f":"IF(Lønmodtager!$A97<>\"ÅÅÅ\",Lønmodtager!AL97,\"\")","v":""},{"$f":"IF(Lønmodtager!$A97<>\"ÅÅÅ\",Lønmodtager!AQ97,\"\")","v":""},{"$f":"IF(Lønmodtager!$A97<>\"ÅÅÅ\",Lønmodtager!AR97,\"\")","v":""}]
[{"$f":"IF(Lønmodtager!$A98<>\"ÅÅÅ\",Lønmodtager!A98,\"\")","v":""},{"$f":"IF(Lønmodtager!$A98<>\"ÅÅÅ\",Lønmodtager!F98,\"\")","v":""},{"$f":"IF(Lønmodtager!$A98<>\"ÅÅÅ\",Lønmodtager!G98,\"\")","v":""},{"$f":"IF(Lønmodtager!$A98<>\"ÅÅÅ\",Lønmodtager!H98,\"\")","v":""},{"$f":"IF(Lønmodtager!$A98<>\"ÅÅÅ\",Lønmodtager!Q98,\"\")","v":""},{"$f":"IF(Lønmodtager!$A98<>\"ÅÅÅ\",Lønmodtager!R98,\"\")","v":""},{"$f":"IF(Lønmodtager!$A98<>\"ÅÅÅ\",Lønmodtager!AA98,\"\")","v":""},{"$f":"IF(Lønmodtager!$A98<>\"ÅÅÅ\",Lønmodtager!AB98,\"\")","v":""},{"$f":"IF(Lønmodtager!$A98<>\"ÅÅÅ\",Lønmodtager!AD98,\"\")","v":""},{"$f":"IF(Lønmodtager!$A98<>\"ÅÅÅ\",Lønmodtager!AC98,\"\")","v":""},{"$f":"IF(Lønmodtager!$A98<>\"ÅÅÅ\",Lønmodtager!AE98,\"\")","v":""},{"$f":"IF(Lønmodtager!$A98<>\"ÅÅÅ\",Lønmodtager!AF98,\"\")","v":""},{"$f":"IF(Lønmodtager!$A98<>\"ÅÅÅ\",Lønmodtager!AG98,\"\")","v":""},{"$f":"IF(Lønmodtager!$A98<>\"ÅÅÅ\",Lønmodtager!AK98,\"\")","v":""},{"$f":"IF(Lønmodtager!$A98<>\"ÅÅÅ\",Lønmodtager!AP98,\"\")","v":""},{"$f":"IF(Lønmodtager!$A98<>\"ÅÅÅ\",Lønmodtager!AL98,\"\")","v":""},{"$f":"IF(Lønmodtager!$A98<>\"ÅÅÅ\",Lønmodtager!AQ98,\"\")","v":""},{"$f":"IF(Lønmodtager!$A98<>\"ÅÅÅ\",Lønmodtager!AR98,\"\")","v":""}]
[{"$f":"IF(Lønmodtager!$A99<>\"ÅÅÅ\",Lønmodtager!A99,\"\")","v":""},{"$f":"IF(Lønmodtager!$A99<>\"ÅÅÅ\",Lønmodtager!F99,\"\")","v":""},{"$f":"IF(Lønmodtager!$A99<>\"ÅÅÅ\",Lønmodtager!G99,\"\")","v":""},{"$f":"IF(Lønmodtager!$A99<>\"ÅÅÅ\",Lønmodtager!H99,\"\")","v":""},{"$f":"IF(Lønmodtager!$A99<>\"ÅÅÅ\",Lønmodtager!Q99,\"\")","v":""},{"$f":"IF(Lønmodtager!$A99<>\"ÅÅÅ\",Lønmodtager!R99,\"\")","v":""},{"$f":"IF(Lønmodtager!$A99<>\"ÅÅÅ\",Lønmodtager!AA99,\"\")","v":""},{"$f":"IF(Lønmodtager!$A99<>\"ÅÅÅ\",Lønmodtager!AB99,\"\")","v":""},{"$f":"IF(Lønmodtager!$A99<>\"ÅÅÅ\",Lønmodtager!AD99,\"\")","v":""},{"$f":"IF(Lønmodtager!$A99<>\"ÅÅÅ\",Lønmodtager!AC99,\"\")","v":""},{"$f":"IF(Lønmodtager!$A99<>\"ÅÅÅ\",Lønmodtager!AE99,\"\")","v":""},{"$f":"IF(Lønmodtager!$A99<>\"ÅÅÅ\",Lønmodtager!AF99,\"\")","v":""},{"$f":"IF(Lønmodtager!$A99<>\"ÅÅÅ\",Lønmodtager!AG99,\"\")","v":""},{"$f":"IF(Lønmodtager!$A99<>\"ÅÅÅ\",Lønmodtager!AK99,\"\")","v":""},{"$f":"IF(Lønmodtager!$A99<>\"ÅÅÅ\",Lønmodtager!AP99,\"\")","v":""},{"$f":"IF(Lønmodtager!$A99<>\"ÅÅÅ\",Lønmodtager!AL99,\"\")","v":""},{"$f":"IF(Lønmodtager!$A99<>\"ÅÅÅ\",Lønmodtager!AQ99,\"\")","v":""},{"$f":"IF(Lønmodtager!$A99<>\"ÅÅÅ\",Lønmodtager!AR99,\"\")","v":""}]
[null,null,null,null,null,"SUM",{"$f":"SUM(G4:G98)","v":0},{"$f":"SUM(H4:H98)","v":0},{"$f":"SUM(I4:I98)","v":0},{"$f":"SUM(J4:J98)","v":0},{"$f":"SUM(K4:K98)","v":0},{"$f":"SUM(L4:L98)","v":0},{"$f":"SUM(M4:M98)","v":0},{"$f":"SUM(N4:N98)","v":0},{"$f":"SUM(O4:O98)","v":0},{"$f":"SUM(P4:P98)","v":0},{"$f":"SUM(Q4:Q98)","v":0},{"$f":"SUM(R4:R98)","v":0}]

{"sheet":"Startuge","index":9,"n_rows":16,"n_cols":8,"rows_kept":16,"cut":false,"hidden":true,"merged":[]}
[null,"Startuge","Startuge","Startuge","Startuge","Startuge","Startuge","År 2000"]
[null,"År 2006","År 2005","År 2004","År 2003","År 2002","År 2001"]
["A",9999,9999,9999,9999,9999,9999,9999]
["April",14,13,14,14,14,14,14]
["August",31,31,31,31,31,31,31]
["December",48,48,49,49,49,49,49]
["Februar",5,5,5,5,5,5,5]
["Januar",1,1,1,1,1,1,1]
["Juli",27,26,27,27,27,27,27]
["Juni",22,22,23,22,23,22,22]
["Maj",18,18,18,18,18,18,18]
["Marts",9,9,9,9,9,9,9]
["November",44,44,44,44,44,44,44]
["Oktober",40,39,40,40,40,40,40]
["September",35,35,36,36,36,36,35]
["Å",9999,9999,9999,9999,9999,9999,9999]

{"sheet":"Bogføring","index":10,"n_rows":1,"n_cols":7,"rows_kept":1,"cut":false,"hidden":true,"merged":[]}
["Dato","Bilagsnummer","Kontonr.","Beløb","Modkonto",null,"Til hver lønseddel afsættes 20 linier (bruges 18 lin)"]

{"sheet":"Lønmodtager Standard","index":11,"n_rows":117,"n_cols":39,"rows_kept":117,"cut":false,"hidden":true,"merged":[]}
["Navne skal indtastes i alfabetisk stigende orden",null,null,null,null,null,null,null,null,null,"Løninde-","Ferie-","Antal",null,null,null,null,null,null,null,null,null,null,null,null,null,"Skal starte i AA"]
[null,"Lønkonto-","Feriekt.","Skyldig","Spc.",null,null,null,null,"Måneds","holdelse","penge","Feriedage",null,null,null,null,null,null,null,null,null,null,"Lønmodt.",null,null,"År Til Dato felter ",{"$f":"\"Dagp.godtg. & Sygedp. \"&REPT(\".\",100)","v":"Dagp.godtg. & Sygedp. ...................................................................................................."},{"$f":"\"AM-bidrag \"&REPT(\".\",100)","v":"AM-bidrag ...................................................................................................."},null,{"$f":"\"SP-bidrag \"&REPT(\".\",100)","v":"SP-bidrag ...................................................................................................."},{"$f":"\"Pensionsbidrag \"&REPT(\".\",100)","v":"Pensionsbidrag ...................................................................................................."},{"$f":"\"ATP lønm.bid. + arbg.bid.\"&REPT(\".\",100)","v":"ATP lønm.bid. + arbg.bid....................................................................................................."},{"$f":"\"Feriepenge \"&REPT(\".\",100)","v":"Feriepenge ...................................................................................................."},{"$f":"\"Udbetalt\"&REPT(\".\",100)","v":"Udbetalt...................................................................................................."},{"$f":"\"Antal gange udb.\"&REPT(\".\",100)","v":"Antal gange udb....................................................................................................."},{"$f":"\"Skattefri . Beford.-\"&REPT(\".\",100)","v":"Skattefri . Beford.-...................................................................................................."},{"$f":"\"Skattefri . Beford.-\"&REPT(\".\",100)","v":"Skattefri . Beford.-...................................................................................................."},"Lønindeholdelse"]
["Navn ","Nummer","Nummer","løn","konto","Adresse","Postnr. Og By","Cpr.nr.","Træk%","fradrag","%","Perioden","Perioden",null,null,null,null,null,null,null,null,null,null,"Række.nr",null,null,{"$f":"\"AM-indkomst\"&REPT(\".\",100)","v":"AM-indkomst...................................................................................................."},{"$f":"\"Excl. AM & SP-bid.\"&REPT(\".\",100)","v":"Excl. AM & SP-bid....................................................................................................."},{"$f":"\" lønmodtager\"&REPT(\".\",100)","v":" lønmodtager...................................................................................................."},{"$f":"\"A-skat\"&REPT(\".\",100)","v":"A-skat...................................................................................................."},{"$f":"\"lønmodtager\"&REPT(\".\",100)","v":"lønmodtager...................................................................................................."},{"$f":"\"lønm. + arb.giver\"&REPT(\".\",100)","v":"lønm. + arb.giver...................................................................................................."},{"$f":"\"+ SP-bidrag dagpenge\"&REPT(\".\",100)","v":"+ SP-bidrag dagpenge...................................................................................................."},{"$f":"\"til betaling\"&REPT(\".\",100)","v":"til betaling...................................................................................................."},{"$f":"\"løn\"&REPT(\".\",100)","v":"løn...................................................................................................."},{"$f":"\"Dagpengegodtg.\"&REPT(\".\",100)","v":"Dagpengegodtg....................................................................................................."},{"$f":"\"godtgørelse kr.\"&REPT(\".\",100)","v":"godtgørelse kr....................................................................................................."},{"$f":"\"godtgørelse km.\"&REPT(\".\",100)","v":"godtgørelse km....................................................................................................."},"Kr."]
["0 : Må ikke slettes",null,6923,6940,6400," "," "," ","100%",0,null,null,null,null,null,null,null,null,null,null,null,null,null,4]
["Albert",2200,6923,6940,null,null,null,null,"40","1000",null,null,null,null,null,null,null,null,null,null,null,null,null,5]
["Bent",2210,6923,6940,null,null,null,null,"45","2000",null,null,null,null,null,null,null,null,null,null,null,null,null,6]
["Gert ",2220,6923,6940,null,null,null,null,"42","3000",null,null,null,null,null,null,null,null,null,null,null,null,null,7]
["Jan ",2230,6923,6940,null,null,null,null,"41","3035",0.12,null,null,null,null,null,null,null,null,null,null,null,null,8]
["Kurt",2240,6923,6940,null,null,null,null,"45","3700",null,null,null,null,null,null,null,null,null,null,null,null,null,9]
["Lars",2250,6923,6940,null,null,null,null,"45","3600",null,null,null,null,null,null,null,null,null,null,null,null,null,10]
["Lone",2260,6923,6940,null,null,null,null,"45","5000",null,null,null,null,null,null,null,null,null,null,null,null,null,11]
["Michael",2270,6923,6940,null,null,null,null,"45","6000",null,null,null,null,null,null,null,null,null,null,null,null,null,12]
["Per ",2280,6923,6940,null,null,null,null,"45","7000",null,null,null,null,null,null,null,null,null,null,null,null,null,13]
["Niels",2290,6923,6940,null,null,null,null,"45","7500",null,null,null,null,null,null,null,null,null,null,null,null,null,14]
["Ole",2300,6923,6940,null,null,null,null,"45","5000",null,null,null,null,null,null,null,null,null,null,null,null,null,15]
["Preben",2310,6923,6940,null,null,null,null,"45","4000",null,null,null,null,null,null,null,null,null,null,null,null,null,16]
["Rene",2320,6923,6940,null,null,null,null,"45","3000",null,null,null,null,null,null,null,null,null,null,null,null,null,17]
["Åse",2330,6923,6940,null,null,null,null,"45","2500",null,null,null,null,null,null,null,null,null,null,null,null,null,18]
["* : Må ikke slettes, skal være sidste post Indtast Navn i Celle F7",null,null,null,null,null,null," ","100%",0,null,null,null,null,null,null,null,null,null,null,null,null,null,19]
[null,null,null,null,null,null,null,null,null,null,null,"---------------",null,null,null,null,null,null,null,null,null,null,null,20]
[null,null,null,null,null,null,null,null,null,null,null,{"$f":"SUM(L4:L20)","v":0},null,null,null,null,null,null,null,null,null,null,null,21]
[null,null,null,null,null,null,null,null,null,null,null,null,null,null,null,null,null,null,null,null,null,null,null,22]
[null,null,null,null,null,null,null,null,null,null,null,null,null,null,null,null,null,null,null,null,null,null,null,23]
["Stil dig på den linie, hvor den nye lønmodtager skal ",null,null,null,null,null,null,null,null,null,null,null,null,null,null,null,null,null,null,null,null,null,null,24]
["indsættes, for at navnene står i stigende orden",null,null,null,null,null,null,null,null,null,null,null,null,null,null,null,null,null,null,null,null,null,null,25]
["Hvis du har brug for en ny linie, så stil dig der,",null,null,null,null,null,null,null,null,null,null,null,null,null,null,null,null,null,null,null,null,null,null,26]
["hvor den nye linie skal være og Tryk ALT+I og Tryk r",null,null,null,null,null,null,null,null,null,null,null,null,null,null,null,null,null,null,null,null,null,null,27]
["Nu skulle der være en ny linie til den nye lønmodtager",null,null,null,null,null,null,null,null,null,null,null,null,null,null,null,null,null,null,null,null,null,null,28]
[null,null,null,null,null,null,null,null,null,null,null,null,null,null,null,null,null,null,null,null,null,null,null,29]
["HUSK også at indtaste data yderst til højre i regnearket",null,null,null,null,null,null,null,null,null,null,null,null,null,null,null,null,null,null,null,null,null,null,30]
[" (Træk% og månedsfradrag fra skattekortet)",null,null,null,null,null,null,null,null,null,null,null,null,null,null,null,null,null,null,null,null,null,null,31]
[null,null,null,null,null,null,null,null,null,null,null,null,null,null,null,null,null,null,null,null,null,null,null,32]
["Hvis du starter brugen af regnsarket i løbet af året, ",null,null,null,null,null,null,null,null,null,null,null,null,null,null,null,null,null,null,null,null,null,null,33]
["så kan År-Til-Dato tal indtastes i kolonnerne AA til AL",null,null,null,null,null,null,null,null,null,null,null,null,null,null,null,null,null,null,null,null,null,null,34]
[null,null,null,null,null,null,null,null,null,null,null,null,null,null,null,null,null,null,null,null,null,null,null,35]
[null,null,null,null,null,null,null,null,null,null,null,null,null,null,null,null,null,null,null,null,null,null,null,36]
[null,null,null,null,null,null,null,null,null,null,null,null,null,null,null,null,null,null,null,null,null,null,null,37]
[null,null,null,null,null,null,null,null,null,null,null,null,null,null,null,null,null,null,null,null,null,null,null,38]
[null,null,null,null,null,null,null,null,null,null,null,null,null,null,null,null,null,null,null,null,null,null,null,39]
[null,null,null,null,null,null,null,null,null,null,null,null,null,null,null,null,null,null,null,null,null,null,null,40]
[null,null,null,null,null,null,null,null,null,null,null,null,null,null,null,null,null,null,null,null,null,null,null,41]
[null,null,null,null,null,null,null,null,null,null,null,null,null,null,null,null,null,null,null,null,null,null,null,42]
[null,null,null,null,null,null,null,null,null,null,null,null,null,null,null,null,null,null,null,null,null,null,null,43]
[null,null,null,null,null,null,null,null,null,null,null,null,null,null,null,null,null,null,null,null,null,null,null,44]
[null,null,null,null,null,null,null,null,null,null,null,null,null,null,null,null,null,null,null,null,null,null,null,45]
[null,null,null,null,null,null,null,null,null,null,null,null,null,null,null,null,null,null,null,null,null,null,null,46]
[null,null,null,null,null,null,null,null,null,null,null,null,null,null,null,null,null,null,null,null,null,null,null,47]
[null,null,null,null,null,null,null,null,null,null,null,null,null,null,null,null,null,null,null,null,null,null,null,48]
[null,null,null,null,null,null,null,null,null,null,null,null,null,null,null,null,null,null,null,null,null,null,null,49]
[null,null,null,null,null,null,null,null,null,null,null,null,null,null,null,null,null,null,null,null,null,null,null,50]
[null,null,null,null,null,null,null,null,null,null,null,null,null,null,null,null,null,null,null,null,null,null,null,51]
[null,null,null,null,null,null,null,null,null,null,null,null,null,null,null,null,null,null,null,null,null,null,null,52]
[null,null,null,null,null,null,null,null,null,null,null,null,null,null,null,null,null,null,null,null,null,null,null,53]
[null,null,null,null,null,null,null,null,null,null,null,null,null,null,null,null,null,null,null,null,null,null,null,54]
[null,null,null,null,null,null,null,null,null,null,null,null,null,null,null,null,null,null,null,null,null,null,null,55]
[null,null,null,null,null,null,null,null,null,null,null,null,null,null,null,null,null,null,null,null,null,null,null,56]
[null,null,null,null,null,null,null,null,null,null,null,null,null,null,null,null,null,null,null,null,null,null,null,57]
[null,null,null,null,null,null,null,null,null,null,null,null,null,null,null,null,null,null,null,null,null,null,null,58]
[null,null,null,null,null,null,null,null,null,null,null,null,null,null,null,null,null,null,null,null,null,null,null,59]
[null,null,null,null,null,null,null,null,null,null,null,null,null,null,null,null,null,null,null,null,null,null,null,60]
[null,null,null,null,null,null,null,null,null,null,null,null,null,null,null,null,null,null,null,null,null,null,null,61]
[null,null,null,null,null,null,null,null,null,null,null,null,null,null,null,null,null,null,null,null,null,null,null,62]
[null,null,null,null,null,null,null,null,null,null,null,null,null,null,null,null,null,null,null,null,null,null,null,63]
[null,null,null,null,null,null,null,null,null,null,null,null,null,null,null,null,null,null,null,null,null,null,null,64]
[null,null,null,null,null,null,null,null,null,null,null,null,null,null,null,null,null,null,null,null,null,null,null,65]
[null,null,null,null,null,null,null,null,null,null,null,null,null,null,null,null,null,null,null,null,null,null,null,66]
[null,null,null,null,null,null,null,null,null,null,null,null,null,null,null,null,null,null,null,null,null,null,null,67]
[null,null,null,null,null,null,null,null,null,null,null,null,null,null,null,null,null,null,null,null,null,null,null,68]
[null,null,null,null,null,null,null,null,null,null,null,null,null,null,null,null,null,null,null,null,null,null,null,69]
[null,null,null,null,null,null,null,null,null,null,null,null,null,null,null,null,null,null,null,null,null,null,null,70]
[null,null,null,null,null,null,null,null,null,null,null,null,null,null,null,null,null,null,null,null,null,null,null,71]
[null,null,null,null,null,null,null,null,null,null,null,null,null,null,null,null,null,null,null,null,null,null,null,72]
[null,null,null,null,null,null,null,null,null,null,null,null,null,null,null,null,null,null,null,null,null,null,null,73]
[null,null,null,null,null,null,null,null,null,null,null,null,null,null,null,null,null,null,null,null,null,null,null,74]
[null,null,null,null,null,null,null,null,null,null,null,null,null,null,null,null,null,null,null,null,null,null,null,75]
[null,null,null,null,null,null,null,null,null,null,null,null,null,null,null,null,null,null,null,null,null,null,null,76]
[null,null,null,null,null,null,null,null,null,null,null,null,null,null,null,null,null,null,null,null,null,null,null,77]
[null,null,null,null,null,null,null,null,null,null,null,null,null,null,null,null,null,null,null,null,null,null,null,78]
[null,null,null,null,null,null,null,null,null,null,null,null,null,null,null,null,null,null,null,null,null,null,null,79]
[null,null,null,null,null,null,null,null,null,null,null,null,null,null,null,null,null,null,null,null,null,null,null,80]
[null,null,null,null,null,null,null,null,null,null,null,null,null,null,null,null,null,null,null,null,null,null,null,81]
[null,null,null,null,null,null,null,null,null,null,null,null,null,null,null,null,null,null,null,null,null,null,null,82]
[null,null,null,null,null,null,null,null,null,null,null,null,null,null,null,null,null,null,null,null,null,null,null,83]
[null,null,null,null,null,null,null,null,null,null,null,null,null,null,null,null,null,null,null,null,null,null,null,84]
[null,null,null,null,null,null,null,null,null,null,null,null,null,null,null,null,null,null,null,null,null,null,null,85]
[null,null,null,null,null,null,null,null,null,null,null,null,null,null,null,null,null,null,null,null,null,null,null,86]
[null,null,null,null,null,null,null,null,null,null,null,null,null,null,null,null,null,null,null,null,null,null,null,87]
[null,null,null,null,null,null,null,null,null,null,null,null,null,null,null,null,null,null,null,null,null,null,null,88]
[null,null,null,null,null,null,null,null,null,null,null,null,null,null,null,null,null,null,null,null,null,null,null,89]
[null,null,null,null,null,null,null,null,null,null,null,null,null,null,null,null,null,null,null,null,null,null,null,90]
[null,null,null,null,null,null,null,null,null,null,null,null,null,null,null,null,null,null,null,null,null,null,null,91]
[null,null,null,null,null,null,null,null,null,null,null,null,null,null,null,null,null,null,null,null,null,null,null,92]
[null,null,null,null,null,null,null,null,null,null,null,null,null,null,null,null,null,null,null,null,null,null,null,93]
[null,null,null,null,null,null,null,null,null,null,null,null,null,null,null,null,null,null,null,null,null,null,null,94]
[null,null,null,null,null,null,null,null,null,null,null,null,null,null,null,null,null,null,null,null,null,null,null,95]
[null,null,null,null,null,null,null,null,null,null,null,null,null,null,null,null,null,null,null,null,null,null,null,96]
[null,null,null,null,null,null,null,null,null,null,null,null,null,null,null,null,null,null,null,null,null,null,null,97]
[null,null,null,null,null,null,null,null,null,null,null,null,null,null,null,null,null,null,null,null,null,null,null,98]
[null,null,null,null,null,null,null,null,null,null,null,null,null,null,null,null,null,null,null,null,null,null,null,99]
[null,null,null,null,null,null,null,null,null,null,null,null,null,null,null,null,null,null,null,null,null,null,null,98]
[null,null,null,null,null,null,null,null,null,null,null,null,null,null,null,null,null,null,null,null,null,null,null,99]
[null,null,null,null,null,null,null,null,null,null,null,null,null,null,null,null,null,null,null,null,null,null,null,99]
[null,null,null,null,null,null,null,null,null,null,null,null,null,null,null,null,null,null,null,null,null,null,null,99]
[null,null,null,null,null,null,null,null,null,null,null,null,null,null,null,null,null,null,null,null,null,null,null,86]
[null,null,null,null,null,null,null,null,null,null,null,null,null,null,null,null,null,null,null,null,null,null,null,87]
[null,null,null,null,null,null,null,null,null,null,null,null,null,null,null,null,null,null,null,null,null,null,null,88]
[null,null,null,null,null,null,null,null,null,null,null,null,null,null,null,null,null,null,null,null,null,null,null,89]
[null,null,null,null,null,null,null,null,null,null,null,null,null,null,null,null,null,null,null,null,null,null,null,90]
[null,null,null,null,null,null,null,null,null,null,null,null,null,null,null,null,null,null,null,null,null,null,null,91]
[null,null,null,null,null,null,null,null,null,null,null,null,null,null,null,null,null,null,null,null,null,null,null,92]
[null,null,null,null,null,null,null,null,null,null,null,null,null,null,null,null,null,null,null,null,null,null,null,93]
[null,null,null,null,null,null,null,null,null,null,null,null,null,null,null,null,null,null,null,null,null,null,null,94]
[null,null,null,null,null,null,null,null,null,null,null,null,null,null,null,null,null,null,null,null,null,null,null,95]
[null,null,null,null,null,null,null,null,null,null,null,null,null,null,null,null,null,null,null,null,null,null,null,96]
[null,null,null,null,null,null,null,null,null,null,null,null,null,null,null,null,null,null,null,null,null,null,null,97]
[null,null,null,null,null,null,null,null,null,null,null,null,null,null,null,null,null,null,null,null,null,null,null,98]
[null,null,null,null,null,null,null,null,null,null,null,null,null,null,null,null,null,null,null,null,null,null,null,99]