{"text_format":"1","workbook":"xlsx","n_sheets":12,"sheets":["Vejledning","Virksomhed","Lønmodtager","Lønseddel","AskatAMSP","ATP-Feriepenge-SH","Afholdt-Ferie","Pension","Oplysningssedler","Startuge","Bogføring","Lønmodtager Standard"],"not_rendered":{"charts":0,"images":0,"macros":1,"external_links":0,"defined_names":21,"comments":4,"pivot_tables":0},"unopened":[],"bounds":{"document_bytes":16777216,"sheet_cells":100000,"rows_first":2000,"rows_last":500,"rows_between":2000,"halvings":0,"cell_chars":16384,"cell_head_chars":4096},"cells_cut":0,"cells_raw":0,"read":"whole","date_system":"1900"}

{"sheet":"Vejledning","index":0,"n_rows":156,"n_cols":2,"rows_kept":156,"cut":false,"hidden":false,"merged":[[0,0,0,2]]}
["BrugerVejledning Net-Løn*Beregning"]
[]
["Zoom = 75%","Afhængig af skærmstørrelse og opløsning kan det"]
[null,"være nødvendigt at gøre visningen på skærmen mindre,"]
[null,"da de enkelte skærmbilleder er meget bredde."]
[null,"Gå op under Vis > Zoom > 75% eller evt. mindre"]
[]
["Vigtigt FIF:","Brug TabulatorTasten, når du har udfyldt et felt,"]
{"$rows_left_out":149}
{"sheet":"Virksomhed","index":1,"n_rows":23,"n_cols":29,"rows_kept":23,"cut":false,"hidden":false,"merged":[]}
["Virksomheder indtastes i stigende SE-NR. orden",null,null,null,null,null,null,null,"Kontoplan systematik for lønkonti v/lønmodtager---------",null,null,null,null,null,null,"Kontonumre for lønkonti v/virksomheden--------------------------",null,null,null,null,null,null,"Lønnen Hæves","Skyldig ","Ej skatpl.","Skyldig","Pensionsb.","Pensions","Skyldig"]
["Virk.navn","SE-nr.","Indehaver","Adresse","Postnr. & By","Lønkladdenavn","Navigatorver.",null,"Dagpenge","ATP","Feriep.&SH","AM-bidrag","SP-bidrag","KM.godtg.","Lønindeh.","ATP","AM-bid.","SP-bid.","Sky.ATP","Sky.AM-bid.","Sky.SP-bid.","Sky.A-skat","Normalt på","Lønindeh.","Regulering","SH-bet.","Lønm.del","Afregning","Pension"]
["A","00 00 00 00","Må ikke slettes",null,null,null,null,"Standard",1,2,5,6,7,8,9,2623,2626,2632,6921,6930,6932,6920,5810,6950,2702,6924,3,2600,6925]
["TestVirk.navn","12 34 56 78","Test.Indehaver","Test.Adr.Virk","1234 Testby","Løn","Navision",null,1,2,5,6,7,8,null,2623,2626,2631,6921,6930,6932,6920,5810,6950,5800,6924,3,2600,6925]
["*","Å","Må ikke slettes"]
[]
[]
["Indtast Virksomhedens Stamdata på linie 4 i Kolonne A til E"]
{"$rows_left_out":16}
{"sheet":"Lønmodtager","index":2,"n_rows":117,"n_cols":44,"rows_kept":117,"cut":false,"hidden":false,"merged":[]}
[null,null,null,null,null,null,null,null,null,null,"Løninde-",null,"Perioden","Betaler","Timeløn","LønPeriode","dd-mm-åå","dd-mm-åå","Beregn","Beregn",null,"Summeret","Feriepenge",null,"Løn overføres",null,"Skal starte i AA"]
["                      ","Løn-","Ferie-","Skyldig","Spc.K.",null,null,null,null,"Måneds","holdelses","Perioden","Antal","SP-bid.?","Fast Løn for lønperioden i ","Løs","Dato","Dato","Pension","SøgneH.","Beregnet","Indbetalt","Funktionær=0","Lønmodt.","Til Bankkonto","d7","År Til Dato felter ","Excl. AM & SP-bid.","Lønmodtager","A-skat","Lønmodtager","lønm. + arb.giver","SP-bidrag dagpenge","Til betaling","Udbetalt","Antal gange udb.","Skattefri","Skattefri","Lønindeh.","Indbetalt","Summering","Skattefri",null,"Ej pensionsb."]
["         Navn ","KontoNr.","KontoNr.","løn",6400,"Adresse","Postnr. Og By","Cpr.nr.","Træk%","fradrag","Procent","Feriepenge","Feriedage","Ja = 1","kolonne P","Uge(1,2,3)","Ansat","Fratrådt","Ja=1","Ja=1","SøgneH.","SøgneH.","Timeløn = 1","Række.nr","Reg.nr.  Kontonr.","d7","AM-indk.","Dagpenge & Sygedp. ","AM-bid.","A-skat","SP-bid.","Pensionsbid.","ATP lønm.bid. + arbg.bid.","Feriepenge","Løn netto","Dagpengegodtg.","Bef.godtg. kr.","Bef.godtg. km.","Kr.","Pension","Timer","Rejsegodtg.","B-Indkomst","Fri Bil ol."]
["0 : Må ikke slettes",2200,6923,6940,0," "," "," ","0",0,null,0,27.5,"Nej = 0",null,"Måned",null,null,"Nej=0","Nej=0",0,0,"Fastløn+feriep.=2",4,"1234  1234567890"]
["Søgenavn indtastes i celle F7",2200,6923,6940,0,"Lønm.adr Mangler i Fanebladet Lønmodtager","Lønm. Postnr.&By mangler i Fanebladet Lønmodtager","000000-0000",60,"0",0,0,0,0,0,"Måned","2007-01-01",null,0,0,0,0,1,5]
["Testperson",2200,6923,6940,0,"Lønm.adr Mangler i Fanebladet Lønmodtager","Lønm. Postnr.&By mangler i Fanebladet Lønmodtager","12345678-1234",46,0,0,0,0,0,200,"Måned","2007-01-01",null,0,0,0,0,1,6]
["ÅÅÅ",2200,6923,6940,0,"Lønm.adr Mangler i Fanebladet Lønmodtager","Lønm. Postnr.&By mangler i Fanebladet Lønmodtager","000000-0000",60,"0",0,0,0,0,0,"Måned","2007-01-01",null,0,0,0,0,1,7]
["ÅÅÅ",2200,6923,6940,0,"Lønm.adr Mangler i Fanebladet Lønmodtager","Lønm. Postnr.&By mangler i Fanebladet Lønmodtager","000000-0000",60,"0",0,0,0,0,0,"Måned","2007-01-01",null,0,0,0,0,1,8]
{"$rows_left_out":110}
{"sheet":"Lønseddel","index":3,"n_rows":174,"n_cols":19,"rows_kept":174,"cut":false,"hidden":false,"merged":[]}
[null,null,null,null,null,"Antal Lønsedler",null,{"$f":"D2","v":"SE-NR.........................."},{"$f":"E2","v":"12 34 56 78"}]
[null,null,null,{"$f":"\"SE-NR.\"&REPT(\".\",25)","v":"SE-NR.........................."},{"$f":"LOOKUP(D3,Virksomhed!A4:A6,Virksomhed!B4:B6)","v":"12 34 56 78"},"Godkendt",{"$f":"R2","v":0},{"$f":"D3","v":"TestVirk.navn"},null,null,null,null,null,null,null,null,null,0,"Antal godkendte lønsedler"]
[null,null,null,{"$f":"Virksomhed!A4","v":"TestVirk.navn"},null,null,null,{"$f":"D4","v":"v/Test.Indehaver"},null,null,null,null,null,null,null,null,null,100,"Maxantal lønsedler Licens"]
[null,null,null,{"$f":"\"v/\"&LOOKUP($D$3,Virksomhed!A4:A6,Virksomhed!C4:C6)","v":"v/Test.Indehaver"},null,null,null,{"$f":"D5","v":"Test.Adr.Virk"}]
[{"$f":"R5","v":0},null,null,{"$f":"LOOKUP($D$3,Virksomhed!A4:A6,Virksomhed!D4:D6)","v":"Test.Adr.Virk"},null,{"$f":"IF(MID(T(A7),1,7)=\"Indtast\",\"Indtast SøgeNavn\",\"\")","v":""},null,{"$f":"D6","v":"1234 Testby"}]
[null,null,null,{"$f":"LOOKUP($D$3,Virksomhed!A4:A6,Virksomhed!E4:E6)","v":"1234 Testby"},null,{"$f":"IF(MID(T(A7),1,7)=\"Indtast\",\"¯¯¯ \",\"\")","v":""},{"$f":"A5","v":0}]
[{"$f":"IF(F7<>MID(H7,1,LEN(F7)),\"Indtast Lønmodtager/SøgeNavn F7\",H7)","v":"Testperson"},null,null,{"$f":"\"CPR-NR.\"&REPT(\".\",100)","v":"CPR-NR....................................................................................................."},{"$f":"LOOKUP(A7,Lønmodtager!A4:A105,Lønmodtager!H4:H105)","v":"12345678-1234"},"test",null,{"$f":"LOOKUP(MID(F7,1,LEN(F7)),MID(Lønmodtager!A4:A100,1,LEN(F7)),Lønmodtager!A4:A100)","v":"Testperson"}]
[{"$f":"IF(F7<>\"SøgeNavn\",LOOKUP(A7,Lønmodtager!A4:A100,Lønmodtager!F4:F100),\"\")","v":"Lønm.adr Mangler i Fanebladet Lønmodtager"},null,null,null,null,"31-01-2019",null,{"$f":"A8","v":"Lønm.adr Mangler i Fanebladet Lønmodtager"}]
{"$rows_left_out":167}
{"sheet":"AskatAMSP","index":4,"n_rows":19,"n_cols":8,"rows_kept":19,"cut":false,"hidden":false,"merged":[]}
[{"$f":"Lønseddel!D2","v":"SE-NR.........................."},null,{"$f":"Lønseddel!E2","v":"12 34 56 78"},null,null,null,null,{"$f":"Lønseddel!B122","v":"2019"}]
[null,null,null,null,null,null,null,{"$f":"Lønseddel!D10","v":"Januar"}]
[{"$f":"Lønseddel!D3","v":"TestVirk.navn"}]
[{"$f":"Lønseddel!D4","v":"v/Test.Indehaver"}]
[{"$f":"Lønseddel!D5","v":"Test.Adr.Virk"}]
[{"$f":"Lønseddel!D6","v":"1234 Testby"}]
[]
[{"$f":"IF(SUM(Lønseddel!C77:'Lønseddel'!C79)<>0,\"Afregningen indeholder den ikke År-Til-Dato opdaterede lønseddel\",\"\")","v":""}]
{"$rows_left_out":12}
{"sheet":"ATP-Feriepenge-SH","index":5,"n_rows":68,"n_cols":11,"rows_kept":68,"cut":false,"hidden":false,"merged":[]}
[]
[]
[{"$f":"Lønseddel!D2","v":"SE-NR.........................."},{"$f":"Lønseddel!E2","v":"12 34 56 78"},null,null,null,null,{"$f":"AskatAMSP!A10","v":"Månedlig Afregning A-skat/AM"},null,null,null,{"$f":"Lønseddel!E10","v":"2019"}]
[{"$f":"Lønseddel!D3","v":"TestVirk.navn"},null,null,null,null,null,"Indberetning elektronisk :","http://www.toldskat.dk/basic.php?source=/tastselverhverv/tastselverhverv.cnt",null,null,{"$f":"Lønseddel!D10","v":"Januar"}]
[{"$f":"Lønseddel!D4","v":"v/Test.Indehaver"},null,null,null,null,null,{"$f":"AskatAMSP!A12","v":""},null,null,{"$f":"AskatAMSP!F12","v":0}]
[{"$f":"Lønseddel!D5","v":"Test.Adr.Virk"},null,null,null,null,null,{"$f":"AskatAMSP!A13","v":""},null,null,{"$f":"AskatAMSP!F13","v":0}]
[{"$f":"Lønseddel!D6","v":"1234 Testby"},null,null,null,null,null,{"$f":"AskatAMSP!A14","v":""},null,null,"------>",{"$f":"SUM(J5:J6)","v":0}]
[]
{"$rows_left_out":61}
{"sheet":"Afholdt-Ferie","index":6,"n_rows":50,"n_cols":18,"rows_kept":50,"cut":false,"hidden":false,"merged":[[1,3,1,15],[0,3,0,15]]}
[{"$f":"\"Afholdt ferie i kalenderåret \"&'ATP-Feriepenge-SH'!K3","v":"Afholdt ferie i kalenderåret 2019"},null,null,"Oplyst i antal dage"]
[null,null,null,"1 uge = 5 dage"]
[{"$f":"'ATP-Feriepenge-SH'!A3","v":"SE-NR.........................."}]
[{"$f":"'ATP-Feriepenge-SH'!A4","v":"TestVirk.navn"},null,"S","J","F","M","A","M","J","J","A","S","O","N","D","S","S","S"]
[{"$f":"'ATP-Feriepenge-SH'!A5","v":"v/Test.Indehaver"},null,"u","a","e","a","p","a","u","u","u","e","k","o","e","u","u","u"]
[{"$f":"'ATP-Feriepenge-SH'!A6","v":"Test.Adr.Virk"},null,"m","n","b","r","r","j","n","l","g","p","t","v","c","m","m","m"]
[{"$f":"'ATP-Feriepenge-SH'!A7","v":"1234 Testby"},null,null,"u","r","t","i",null,"i","i","u","t","o","e","e"]
[null,null,"A","a","u","s","l",null,null,null,"s","e","b","m","m","A","A","A"]
{"$rows_left_out":43}
{"sheet":"Pension","index":7,"n_rows":105,"n_cols":5,"rows_kept":105,"cut":false,"hidden":false,"merged":[]}
[{"$f":"Lønseddel!D2","v":"SE-NR.........................."},{"$f":"Lønseddel!E2","v":"12 34 56 78"},null,null,{"$f":"Lønseddel!D10","v":"Januar"}]
[{"$f":"Lønseddel!D3","v":"TestVirk.navn"},null,null,null,{"$f":"Lønseddel!E10","v":"2019"}]
[{"$f":"Lønseddel!D4","v":"v/Test.Indehaver"}]
[{"$f":"Lønseddel!D5","v":"Test.Adr.Virk"}]
[{"$f":"Lønseddel!D6","v":"1234 Testby"}]
[]
[{"$f":"IF(Lønseddel!C80<>0,\"Pension indeholder IKKE den ej År-Til-Dato opdaterede lønseddel\",\"\")","v":""}]
[]
{"$rows_left_out":98}
{"sheet":"Oplysningssedler","index":8,"n_rows":99,"n_cols":18,"rows_kept":99,"cut":false,"hidden":false,"merged":[]}
[]
[{"$f":"Lønmodtager!A3","v":"         Navn "},{"$f":"Lønmodtager!F3","v":"Adresse"},{"$f":"Lønmodtager!G3","v":"Postnr. Og By"},{"$f":"Lønmodtager!H3","v":"Cpr.nr."},{"$f":"Lønmodtager!Q3","v":"Ansat"},{"$f":"Lønmodtager!R3","v":"Fratrådt"},{"$f":"Lønmodtager!AA3","v":"AM-indk."},{"$f":"MID(Lønmodtager!AB3,1,8)","v":"Dagpenge"},{"$f":"Lønmodtager!AD3","v":"A-skat"},{"$f":"Lønmodtager!AC3","v":"AM-bid."},{"$f":"Lønmodtager!AE3","v":"SP-bid."},{"$f":"Lønmodtager!AF3","v":"Pensionsbid."},{"$f":"MID(Lønmodtager!AG3,1,3)","v":"ATP"},{"$f":"MID(Lønmodtager!AK3,1,10)","v":"Bef.godtg."},{"$f":"MID(Lønmodtager!AP3,1,10)","v":"Rejsegodtg"},{"$f":"MID(Lønmodtager!AO3,1,10)","v":"Timer"},{"$f":"MID(Lønmodtager!AQ3,1,10)","v":"B-Indkomst"},{"$f":"MID(Lønmodtager!AR3,1,10)","v":"Fri Bil ol"}]
[]
[{"$f":"IF(Lønmodtager!$A5<>\"ÅÅÅ\",Lønmodtager!A5,\"\")","v":"Søgenavn indtastes i celle F7"},{"$f":"IF(Lønmodtager!$A5<>\"ÅÅÅ\",Lønmodtager!F5,\"\")","v":"Lønm.adr Mangler i Fanebladet Lønmodtager"},{"$f":"IF(Lønmodtager!$A5<>\"ÅÅÅ\",Lønmodtager!G5,\"\")","v":"Lønm. Postnr.&By mangler i Fanebladet Lønmodtager"},{"$f":"IF(Lønmodtager!$A5<>\"ÅÅÅ\",Lønmodtager!H5,\"\")","v":"000000-0000"},{"$f":"IF(Lønmodtager!$A5<>\"ÅÅÅ\",Lønmodtager!Q5,\"\")","v":"2007-01-01"},{"$f":"IF(Lønmodtager!$A5<>\"ÅÅÅ\",Lønmodtager!R5,\"\")","v":"00:00:00"},{"$f":"IF(Lønmodtager!$A5<>\"ÅÅÅ\",Lønmodtager!AA5,\"\")","v":0},{"$f":"IF(Lønmodtager!$A5<>\"ÅÅÅ\",Lønmodtager!AB5,\"\")","v":0},{"$f":"IF(Lønmodtager!$A5<>\"ÅÅÅ\",Lønmodtager!AD5,\"\")","v":0},{"$f":"IF(Lønmodtager!$A5<>\"ÅÅÅ\",Lønmodtager!AC5,\"\")","v":0},{"$f":"IF(Lønmodtager!$A5<>\"ÅÅÅ\",Lønmodtager!AE5,\"\")","v":0},{"$f":"IF(Lønmodtager!$A5<>\"ÅÅÅ\",Lønmodtager!AF5,\"\")","v":0},{"$f":"IF(Lønmodtager!$A5<>\"ÅÅÅ\",Lønmodtager!AG5,\"\")","v":0},{"$f":"IF(Lønmodtager!$A5<>\"ÅÅÅ\",Lønmodtager!AK5,\"\")","v":0},{"$f":"IF(Lønmodtager!$A5<>\"ÅÅÅ\",Lønmodtager!AP5,\"\")","v":0},{"$f":"IF(Lønmodtager!$A5<>\"ÅÅÅ\",Lønmodtager!AO5,\"\")","v":0},{"$f":"IF(Lønmodtager!$A5<>\"ÅÅÅ\",Lønmodtager!AQ5,\"\")","v":0},{"$f":"IF(Lønmodtager!$A5<>\"ÅÅÅ\",Lønmodtager!AR5,\"\")","v":0}]
[{"$f":"IF(Lønmodtager!$A6<>\"ÅÅÅ\",Lønmodtager!A6,\"\")","v":"Testperson"},{"$f":"IF(Lønmodtager!$A6<>\"ÅÅÅ\",Lønmodtager!F6,\"\")","v":"Lønm.adr Mangler i Fanebladet Lønmodtager"},{"$f":"IF(Lønmodtager!$A6<>\"ÅÅÅ\",Lønmodtager!G6,\"\")","v":"Lønm. Postnr.&By mangler i Fanebladet Lønmodtager"},{"$f":"IF(Lønmodtager!$A6<>\"ÅÅÅ\",Lønmodtager!H6,\"\")","v":"12345678-1234"},{"$f":"IF(Lønmodtager!$A6<>\"ÅÅÅ\",Lønmodtager!Q6,\"\")","v":"2007-01-01"},{"$f":"IF(Lønmodtager!$A6<>\"ÅÅÅ\",Lønmodtager!R6,\"\")","v":"00:00:00"},{"$f":"IF(Lønmodtager!$A6<>\"ÅÅÅ\",Lønmodtager!AA6,\"\")","v":0},{"$f":"IF(Lønmodtager!$A6<>\"ÅÅÅ\",Lønmodtager!AB6,\"\")","v":0},{"$f":"IF(Lønmodtager!$A6<>\"ÅÅÅ\",Lønmodtager!AD6,\"\")","v":0},{"$f":"IF(Lønmodtager!$A6<>\"ÅÅÅ\",Lønmodtager!AC6,\"\")","v":0},{"$f":"IF(Lønmodtager!$A6<>\"ÅÅÅ\",Lønmodtager!AE6,\"\")","v":0},{"$f":"IF(Lønmodtager!$A6<>\"ÅÅÅ\",Lønmodtager!AF6,\"\")","v":0},{"$f":"IF(Lønmodtager!$A6<>\"ÅÅÅ\",Lønmodtager!AG6,\"\")","v":0},{"$f":"IF(Lønmodtager!$A6<>\"ÅÅÅ\",Lønmodtager!AK6,\"\")","v":0},{"$f":"IF(Lønmodtager!$A6<>\"ÅÅÅ\",Lønmodtager!AP6,\"\")","v":0},{"$f":"IF(Lønmodtager!$A6<>\"ÅÅÅ\",Lønmodtager!AO6,\"\")","v":0},{"$f":"IF(Lønmodtager!$A6<>\"ÅÅÅ\",Lønmodtager!AQ6,\"\")","v":0},{"$f":"IF(Lønmodtager!$A6<>\"ÅÅÅ\",Lønmodtager!AR6,\"\")","v":0}]
[{"$f":"IF(Lønmodtager!$A7<>\"ÅÅÅ\",Lønmodtager!A7,\"\")","v":""},{"$f":"IF(Lønmodtager!$A7<>\"ÅÅÅ\",Lønmodtager!F7,\"\")","v":""},{"$f":"IF(Lønmodtager!$A7<>\"ÅÅÅ\",Lønmodtager!G7,\"\")","v":""},{"$f":"IF(Lønmodtager!$A7<>\"ÅÅÅ\",Lønmodtager!H7,\"\")","v":""},{"$f":"IF(Lønmodtager!$A7<>\"ÅÅÅ\",Lønmodtager!Q7,\"\")","v":""},{"$f":"IF(Lønmodtager!$A7<>\"ÅÅÅ\",Lønmodtager!R7,\"\")","v":""},{"$f":"IF(Lønmodtager!$A7<>\"ÅÅÅ\",Lønmodtager!AA7,\"\")","v":""},{"$f":"IF(Lønmodtager!$A7<>\"ÅÅÅ\",Lønmodtager!AB7,\"\")","v":""},{"$f":"IF(Lønmodtager!$A7<>\"ÅÅÅ\",Lønmodtager!AD7,\"\")","v":""},{"$f":"IF(Lønmodtager!$A7<>\"ÅÅÅ\",Lønmodtager!AC7,\"\")","v":""},{"$f":"IF(Lønmodtager!$A7<>\"ÅÅÅ\",Lønmodtager!AE7,\"\")","v":""},{"$f":"IF(Lønmodtager!$A7<>\"ÅÅÅ\",Lønmodtager!AF7,\"\")","v":""},{"$f":"IF(Lønmodtager!$A7<>\"ÅÅÅ\",Lønmodtager!AG7,\"\")","v":""},{"$f":"IF(Lønmodtager!$A7<>\"ÅÅÅ\",Lønmodtager!AK7,\"\")","v":""},{"$f":"IF(Lønmodtager!$A7<>\"ÅÅÅ\",Lønmodtager!AP7,\"\")","v":""},{"$f":"IF(Lønmodtager!$A7<>\"ÅÅÅ\",Lønmodtager!AO7,\"\")","v":""},{"$f":"IF(Lønmodtager!$A7<>\"ÅÅÅ\",Lønmodtager!AQ7,\"\")","v":""},{"$f":"IF(Lønmodtager!$A7<>\"ÅÅÅ\",Lønmodtager!AR7,\"\")","v":""}]
[{"$f":"IF(Lønmodtager!$A8<>\"ÅÅÅ\",Lønmodtager!A8,\"\")","v":""},{"$f":"IF(Lønmodtager!$A8<>\"ÅÅÅ\",Lønmodtager!F8,\"\")","v":""},{"$f":"IF(Lønmodtager!$A8<>\"ÅÅÅ\",Lønmodtager!G8,\"\")","v":""},{"$f":"IF(Lønmodtager!$A8<>\"ÅÅÅ\",Lønmodtager!H8,\"\")","v":""},{"$f":"IF(Lønmodtager!$A8<>\"ÅÅÅ\",Lønmodtager!Q8,\"\")","v":""},{"$f":"IF(Lønmodtager!$A8<>\"ÅÅÅ\",Lønmodtager!R8,\"\")","v":""},{"$f":"IF(Lønmodtager!$A8<>\"ÅÅÅ\",Lønmodtager!AA8,\"\")","v":""},{"$f":"IF(Lønmodtager!$A8<>\"ÅÅÅ\",Lønmodtager!AB8,\"\")","v":""},{"$f":"IF(Lønmodtager!$A8<>\"ÅÅÅ\",Lønmodtager!AD8,\"\")","v":""},{"$f":"IF(Lønmodtager!$A8<>\"ÅÅÅ\",Lønmodtager!AC8,\"\")","v":""},{"$f":"IF(Lønmodtager!$A8<>\"ÅÅÅ\",Lønmodtager!AE8,\"\")","v":""},{"$f":"IF(Lønmodtager!$A8<>\"ÅÅÅ\",Lønmodtager!AF8,\"\")","v":""},{"$f":"IF(Lønmodtager!$A8<>\"ÅÅÅ\",Lønmodtager!AG8,\"\")","v":""},{"$f":"IF(Lønmodtager!$A8<>\"ÅÅÅ\",Lønmodtager!AK8,\"\")","v":""},{"$f":"IF(Lønmodtager!$A8<>\"ÅÅÅ\",Lønmodtager!AP8,\"\")","v":""},{"$f":"IF(Lønmodtager!$A8<>\"ÅÅÅ\",Lønmodtager!AO8,\"\")","v":""},{"$f":"IF(Lønmodtager!$A8<>\"ÅÅÅ\",Lønmodtager!AQ8,\"\")","v":""},{"$f":"IF(Lønmodtager!$A8<>\"ÅÅÅ\",Lønmodtager!AR8,\"\")","v":""}]
[{"$f":"IF(Lønmodtager!$A9<>\"ÅÅÅ\",Lønmodtager!A9,\"\")","v":""},{"$f":"IF(Lønmodtager!$A9<>\"ÅÅÅ\",Lønmodtager!F9,\"\")","v":""},{"$f":"IF(Lønmodtager!$A9<>\"ÅÅÅ\",Lønmodtager!G9,\"\")","v":""},{"$f":"IF(Lønmodtager!$A9<>\"ÅÅÅ\",Lønmodtager!H9,\"\")","v":""},{"$f":"IF(Lønmodtager!$A9<>\"ÅÅÅ\",Lønmodtager!Q9,\"\")","v":""},{"$f":"IF(Lønmodtager!$A9<>\"ÅÅÅ\",Lønmodtager!R9,\"\")","v":""},{"$f":"IF(Lønmodtager!$A9<>\"ÅÅÅ\",Lønmodtager!AA9,\"\")","v":""},{"$f":"IF(Lønmodtager!$A9<>\"ÅÅÅ\",Lønmodtager!AB9,\"\")","v":""},{"$f":"IF(Lønmodtager!$A9<>\"ÅÅÅ\",Lønmodtager!AD9,\"\")","v":""},{"$f":"IF(Lønmodtager!$A9<>\"ÅÅÅ\",Lønmodtager!AC9,\"\")","v":""},{"$f":"IF(Lønmodtager!$A9<>\"ÅÅÅ\",Lønmodtager!AE9,\"\")","v":""},{"$f":"IF(Lønmodtager!$A9<>\"ÅÅÅ\",Lønmodtager!AF9,\"\")","v":""},{"$f":"IF(Lønmodtager!$A9<>\"ÅÅÅ\",Lønmodtager!AG9,\"\")","v":""},{"$f":"IF(Lønmodtager!$A9<>\"ÅÅÅ\",Lønmodtager!AK9,\"\")","v":""},{"$f":"IF(Lønmodtager!$A9<>\"ÅÅÅ\",Lønmodtager!AP9,\"\")","v":""},{"$f":"IF(Lønmodtager!$A9<>\"ÅÅÅ\",Lønmodtager!AO9,\"\")","v":""},{"$f":"IF(Lønmodtager!$A9<>\"ÅÅÅ\",Lønmodtager!AQ9,\"\")","v":""},{"$f":"IF(Lønmodtager!$A9<>\"ÅÅÅ\",Lønmodtager!AR9,\"\")","v":""}]
{"$rows_left_out":92}
{"sheet":"Startuge","index":9,"n_rows":16,"n_cols":8,"rows_kept":16,"cut":false,"hidden":true,"merged":[]}
[null,"Startuge","Startuge","Startuge","Startuge","Startuge","Startuge","År 2000"]
[null,"År 2006","År 2005","År 2004","År 2003","År 2002","År 2001"]
["A",9999,9999,9999,9999,9999,9999,9999]
["April",14,13,14,14,14,14,14]
["August",31,31,31,31,31,31,31]
["December",48,48,49,49,49,49,49]
["Februar",5,5,5,5,5,5,5]
["Januar",1,1,1,1,1,1,1]
{"$rows_left_out":9}
{"sheet":"Bogføring","index":10,"n_rows":1,"n_cols":7,"rows_kept":1,"cut":false,"hidden":true,"merged":[]}
["Dato","Bilagsnummer","Kontonr.","Beløb","Modkonto",null,"Til hver lønseddel afsættes 20 linier (bruges 18 lin)"]

{"sheet":"Lønmodtager Standard","index":11,"n_rows":117,"n_cols":39,"rows_kept":117,"cut":false,"hidden":true,"merged":[]}
["Navne skal indtastes i alfabetisk stigende orden",null,null,null,null,null,null,null,null,null,"Løninde-","Ferie-","Antal",null,null,null,null,null,null,null,null,null,null,null,null,null,"Skal starte i AA"]
[null,"Lønkonto-","Feriekt.","Skyldig","Spc.",null,null,null,null,"Måneds","holdelse","penge","Feriedage",null,null,null,null,null,null,null,null,null,null,"Lønmodt.",null,null,"År Til Dato felter ",{"$f":"\"Dagp.godtg. & Sygedp. \"&REPT(\".\",100)","v":"Dagp.godtg. & Sygedp. ...................................................................................................."},{"$f":"\"AM-bidrag \"&REPT(\".\",100)","v":"AM-bidrag ...................................................................................................."},null,{"$f":"\"SP-bidrag \"&REPT(\".\",100)","v":"SP-bidrag ...................................................................................................."},{"$f":"\"Pensionsbidrag \"&REPT(\".\",100)","v":"Pensionsbidrag ...................................................................................................."},{"$f":"\"ATP lønm.bid. + arbg.bid.\"&REPT(\".\",100)","v":"ATP lønm.bid. + arbg.bid....................................................................................................."},{"$f":"\"Feriepenge \"&REPT(\".\",100)","v":"Feriepenge ...................................................................................................."},{"$f":"\"Udbetalt\"&REPT(\".\",100)","v":"Udbetalt...................................................................................................."},{"$f":"\"Antal gange udb.\"&REPT(\".\",100)","v":"Antal gange udb....................................................................................................."},{"$f":"\"Skattefri . Beford.-\"&REPT(\".\",100)","v":"Skattefri . Beford.-...................................................................................................."},{"$f":"\"Skattefri . Beford.-\"&REPT(\".\",100)","v":"Skattefri . Beford.-...................................................................................................."},"Lønindeholdelse"]
["Navn ","Nummer","Nummer","løn","konto","Adresse","Postnr. Og By","Cpr.nr.","Træk%","fradrag","%","Perioden","Perioden",null,null,null,null,null,null,null,null,null,null,"Række.nr",null,null,{"$f":"\"AM-indkomst\"&REPT(\".\",100)","v":"AM-indkomst...................................................................................................."},{"$f":"\"Excl. AM & SP-bid.\"&REPT(\".\",100)","v":"Excl. AM & SP-bid....................................................................................................."},{"$f":"\" lønmodtager\"&REPT(\".\",100)","v":" lønmodtager...................................................................................................."},{"$f":"\"A-skat\"&REPT(\".\",100)","v":"A-skat...................................................................................................."},{"$f":"\"lønmodtager\"&REPT(\".\",100)","v":"lønmodtager...................................................................................................."},{"$f":"\"lønm. + arb.giver\"&REPT(\".\",100)","v":"lønm. + arb.giver...................................................................................................."},{"$f":"\"+ SP-bidrag dagpenge\"&REPT(\".\",100)","v":"+ SP-bidrag dagpenge...................................................................................................."},{"$f":"\"til betaling\"&REPT(\".\",100)","v":"til betaling...................................................................................................."},{"$f":"\"løn\"&REPT(\".\",100)","v":"løn...................................................................................................."},{"$f":"\"Dagpengegodtg.\"&REPT(\".\",100)","v":"Dagpengegodtg....................................................................................................."},{"$f":"\"godtgørelse kr.\"&REPT(\".\",100)","v":"godtgørelse kr....................................................................................................."},{"$f":"\"godtgørelse km.\"&REPT(\".\",100)","v":"godtgørelse km....................................................................................................."},"Kr."]
["0 : Må ikke slettes",null,6923,6940,6400," "," "," ","100%",0,null,null,null,null,null,null,null,null,null,null,null,null,null,4]
["Albert",2200,6923,6940,null,null,null,null,"40","1000",null,null,null,null,null,null,null,null,null,null,null,null,null,5]
["Bent",2210,6923,6940,null,null,null,null,"45","2000",null,null,null,null,null,null,null,null,null,null,null,null,null,6]
["Gert ",2220,6923,6940,null,null,null,null,"42","3000",null,null,null,null,null,null,null,null,null,null,null,null,null,7]
["Jan ",2230,6923,6940,null,null,null,null,"41","3035",0.12,null,null,null,null,null,null,null,null,null,null,null,null,8]
{"$rows_left_out":109}